program: Gaussian 09
title: 000263096
version: EM64L-G09RevD.01
frameworkgroup: C1[X(C15H14N2O2)]
method: RPBEPBE
basis: SDD
operation: Freq
keyword: #p
keyword: freq=noraman
keyword: PBEPBE/SDD
title: #p freq=noraman PBEPBE/SDD
converged: YES YES NO NO
title: Mulliken charges:
elementType: O O N N C C C C C C C C C C C C C C C H H H H H H H H H H H H H H
charge: -0.277438 -0.277758 0.002372 0.001364 0.166829 0.166528 0.241091 0.241251 -0.330185 -0.330190 -0.354649 -0.354613 -0.246955 -0.246900 -0.231004 -0.231087 -0.150471 -0.532366 -0.532254 0.236317 0.236207 0.255753 0.255710 0.224126 0.224100 0.228289 0.228297 0.220681 0.223247 0.249855 0.249864 0.220824 0.223166
chargesum: 0.00000
title: Mulliken charges with hydrogens summed into heavy atoms:
elementType: O O N N C C C C C C C C C C C C C C C
charge: -0.277438 -0.277758 0.002372 0.001364 0.166829 0.166528 0.241091 0.241251 -0.093868 -0.093983 -0.098896 -0.098902 -0.022829 -0.022800 -0.002715 -0.002790 -0.150471 0.161418 0.161600
polarizability: 3.36836136e+02 4.01666952e+01 1.50728868e+02 -7.01628662e-02 -1.59824454e-02 1.35358971e+02
1716.lowfreq: -8.3443 -3.8658 -0.0007 -0.0005 0.0003 5.9443 15.0048 27.1720 27.3998
frequency: 14.9254 27.1313 27.2678 84.1285 86.5724 95.9203 99.5418 175.2318 185.3715 217.9063 224.5887 243.9188 245.4329 254.1018 300.8240 310.9952 341.7928 381.1260 450.6551 457.4823 460.1479 492.7966 495.1382 534.8201 542.3263 554.5617 560.9623 573.6613 579.5153 692.2022 725.3968 726.9316 730.3882 749.9509 750.5032 770.6353 820.7267 844.4725 844.9056 925.1377 925.5291 968.0065 968.0812 988.8806 989.1253 1032.0698 1036.6267 1056.9119 1104.7034 1113.9682 1114.1744 1125.2701 1152.2776 1158.5663 1169.0661 1169.8057 1205.0877 1226.4120 1251.2817 1269.0380 1275.6580 1377.0361 1378.3475 1420.9592 1427.0929 1436.2684 1445.2890 1464.1714 1467.7656 1467.9001 1469.7652 1476.0995 1488.0163 1572.0454 1580.9786 1582.7178 1597.0642 1617.1907 2230.5845 2961.5566 2962.0661 3050.4567 3051.0894 3129.1744 3129.2683 3134.1221 3134.1960 3149.0064 3149.2035 3161.2266 3161.5935 3174.0521 3174.2048
redmass: 4.2987 5.1738 5.1630 5.2325 5.2596 3.3477 3.2445 3.3629 2.9393 3.2698 2.3329 1.6948 1.8854 2.9136 3.7245 4.1082 6.1381 6.3306 3.8467 6.4249 3.2960 5.9526 6.1625 7.5444 7.1360 3.9922 4.0472 6.4059 6.6858 5.8221 3.9752 5.1196 3.9598 1.2452 1.2407 5.9879 6.2223 1.4352 1.4426 1.3672 1.3708 1.3077 1.3078 8.7109 8.7067 2.7205 2.0535 3.6166 1.9743 1.2574 1.2573 1.5613 1.3984 1.3392 1.1069 1.1014 2.6062 3.3947 2.8840 1.5103 1.6374 7.4902 7.8692 1.9481 1.5298 1.3511 1.6355 1.9054 1.0522 1.0611 1.1705 1.1868 2.2300 7.0152 6.9300 7.3510 6.4513 8.1683 12.5566 1.0328 1.0328 1.1040 1.1041 1.0992 1.0992 1.0854 1.0854 1.0897 1.0898 1.0945 1.0944 1.1002 1.1002
irintensity: 0.6235 0.7186 1.1868 3.7766 0.5015 6.6708 6.3511 0.5581 0.4915 0.0545 1.3946 0.9168 0.2007 0.0034 0.2135 0.0110 25.7938 0.5371 0.2992 7.4766 6.9581 32.9957 4.1638 5.8414 125.3390 4.3583 0.0682 8.1647 6.3502 5.1269 1.9665 9.0964 0.1842 107.9475 105.4156 11.8419 5.5701 0.2360 0.1633 4.5023 4.4026 0.2171 0.2417 45.9840 40.1190 0.5029 39.0357 30.9050 47.7663 0.1529 0.1168 11.3921 3.1566 0.1370 8.4356 3.1572 66.8339 51.4485 142.4795 4.5599 62.3441 3.4274 5.2342 4.9934 18.9772 0.7414 48.7977 25.5408 18.2406 14.8029 101.4692 1.3693 148.3121 0.3195 4.1356 2.4267 132.8424 16.1321 2760.3716 66.8670 58.9204 44.0661 43.0653 10.1780 19.5880 0.3278 0.3659 16.4572 12.3492 27.3391 24.8762 37.4849 0.6370
temp: 298.150 k
press: 1.00000 atm
elementType: 8 8 7 7 6 6 6 6 6 6 6 6 6 6 6 6 6 6 6 1 1 1 1 1 1 1 1 1 1 1 1 1 1
symmnumber: 1
zpe: 669437.1 jmol-1
zpe.correction: 0.254975 hartree
zpe.thermalcorrener: 0.272657 hartree
zpe.thermalcorrenthalpy: 0.273602 hartree
zpe.thermalcorrgfe: 0.207133 hartree
zpe.sumelectzpe: -838.547238 hartree
zpe.sumelectthermal: -838.529556 hartree
zpe.sumelectthermalent: -838.528612 hartree
zpe.sumelectthermalfe: -838.595080 hartree
dipole: -0.0108 -0.0061 4.0206
dipole: 4.0206
quadrupole: -94.4043 -98.9059 -105.9307
quadrupole: -4.6373 -0.0114 0.0048
quadrupole: 5.3427 0.8410 -6.1837 -4.6373 -0.0114 0.0048
hfenergy: -838.8022136 hartree
pointgroup: C01 [X(C15H14N2O2)]
dipole: 0.0472459 -1.3655089 -0.7970938 debye
polarizability: 333.419086|-17.9353949|138.8720108|43.7897887|-7.2155361|150.6328775 unknown
InChI: InChI=1S/C15H14N2O2/c1-18-14-9-5-3-7-12(14)16-11-17-13-8-4-6-10-15(13)19-2/h3-10H,1-2H3
charge 0 multiplicity 1
33 atoms
O  -1.673253 -1.128258 0.714812
O  1.693182 0.302161 -1.530987
N  -1.155509 1.508573 0.07624
N  1.055609 1.023786 1.05714
C  -2.419511 0.962559 -0.162981
C  2.354844 0.616588 0.740958
C  -2.72967 -0.401898 0.15272
C  2.727007 0.232234 -0.589813
C  -4.020097 -0.916262 -0.104099
C  4.051228 -0.172742 -0.869343
C  -3.426763 1.777064 -0.732133
C  3.33558 0.583721 1.760294
C  -5.011521 -0.08263 -0.674605
C  5.01534 -0.197887 0.166585
C  -4.716364 1.262313 -0.987886
C  4.659276 0.180528 1.479606
C  -0.045055 1.14373 0.494772
C  -1.91812 -2.525271 1.076593
C  2.000777 -0.058964 -2.915807
H  -4.260253 -1.956382 0.136982
H  4.339002 -0.466313 -1.883672
H  -3.171476 2.815361 -0.964704
H  3.032672 0.882411 2.768432
H  -6.00983 -0.489049 -0.869525
H  6.040185 -0.511663 -0.059312
H  -5.483017 1.908121 -1.427874
H  5.404758 0.163033 2.281061
H  -2.18985 -3.127614 0.18795
H  -2.715978 -2.606167 1.840075
H  -0.965634 -2.88343 1.493164
H  1.05716 0.079624 -3.462975
H  2.327311 -1.114333 -2.991656
H  2.780669 0.604156 -3.337711
