program: Gaussian 09
title: 000263055
version: EM64L-G09RevD.01
frameworkgroup: C1[X(C16H12O5)]
method: RPBEPBE
basis: SDD
operation: Freq
keyword: #pfreq=noraman
keyword: PBEPBE/SDD
title: #p freq=noraman PBEPBE/SDD
converged: NO YES NO NO
title: Mulliken charges:
elementType: O O O O O C C C C C C C C C C C C C C C C H H H H H H H H H H H H
charge: -0.215581 -0.273753 -0.202685 -0.425365 -0.425263 0.066116 -0.538088 0.368680 0.362682 -0.553615 0.135299 0.135128 0.186755 -0.331883 -0.323117 -0.542477 -0.506376 -0.400150 -0.437397 0.315612 0.321168 0.268667 0.265926 0.265009 0.262710 0.238026 0.236063 0.258555 0.286002 0.257159 0.226263 0.360271 0.359660
chargesum: 0.00000
title: Mulliken charges with hydrogens summed into heavy atoms:
elementType: O O O O O C C C C C C C C C C C C C C C C
charge: -0.215581 -0.273753 -0.202685 -0.065095 -0.065603 0.066116 -0.003495 0.368680 0.362682 -0.025897 0.135299 0.135128 0.186755 -0.093857 -0.087054 -0.283922 -0.220374 -0.142991 -0.211134 0.315612 0.321168
polarizability: 2.65387821e+02 -1.93966750e+00 2.18770250e+02 -2.29517654e-01 6.93310643e+00 9.77741687e+01
1716.lowfreq: -56.9020 -0.0009 -0.0005 0.0004 2.3557 4.8380 9.0693 36.2425 54.0967
frequency: -56.8618 35.9838 54.0785 64.2838 89.4194 152.8095 187.7573 209.9695 236.2630 242.7258 270.3018 300.9591 318.0534 319.9681 355.3330 369.4408 377.0442 380.4246 414.6704 452.6487 460.1407 474.6269 509.2561 529.2918 547.0351 590.1691 592.0319 595.9533 609.1755 626.9147 655.5208 716.0252 716.5853 729.1652 740.4555 742.9195 780.7818 791.7762 815.2477 835.3437 836.6058 862.1343 867.3022 875.1194 921.8318 933.1627 952.6036 975.6652 991.8980 1026.7961 1043.3852 1098.6477 1101.3214 1123.2809 1131.1306 1139.1023 1149.5746 1165.0587 1191.6418 1212.0236 1214.0927 1231.7354 1255.3531 1261.7093 1280.5829 1297.2528 1306.4265 1314.7311 1397.2216 1407.5195 1433.8689 1449.9990 1451.1385 1491.7935 1498.4196 1502.4539 1584.0775 1604.3393 1630.4864 1647.6688 1685.3861 3020.9886 3044.4758 3073.0643 3105.8423 3124.0556 3137.1833 3147.1093 3147.9595 3181.9717 3188.9807 3583.9157 3587.1096
redmass: 2.3287 5.1602 8.0499 8.3048 4.8481 6.5639 5.0952 6.6379 7.1410 3.4043 6.6316 6.5094 5.5949 8.0728 1.1232 1.1345 6.4053 4.7465 4.6455 3.4893 4.4308 3.2536 2.8530 4.5850 5.1903 7.2598 8.7629 6.9036 4.1037 3.7805 7.2020 7.4565 3.3117 3.8160 6.6761 6.7717 1.6050 1.4816 1.4624 2.8443 2.8780 1.6348 5.1765 2.5547 3.5223 1.5096 1.3885 3.1550 4.1266 2.2469 3.2154 1.9973 2.0557 5.3119 1.5767 1.2737 1.3425 1.3019 1.7183 1.5938 2.4217 1.3930 2.4337 1.4714 2.4367 1.4817 2.7091 1.8798 7.7239 7.5631 3.9801 1.2055 2.9092 1.1672 3.1420 2.6712 7.2750 7.8254 7.0600 7.2594 12.6957 1.0605 1.0623 1.1025 1.1042 1.0872 1.0894 1.0967 1.0923 1.0955 1.0930 1.0661 1.0661
irintensity: 1.1276 0.5845 4.9393 1.5356 1.2438 1.7745 2.6233 1.9385 2.0893 0.7954 0.1130 3.9709 3.6146 3.8525 134.1842 147.3532 13.6444 4.8989 20.7385 18.6698 9.4687 2.9736 1.2562 1.7400 7.0467 13.9388 5.4889 11.9853 1.6080 46.3451 4.5582 2.8972 4.3246 1.3735 6.0460 8.8452 4.8523 43.9195 6.5164 65.6321 159.5284 31.9350 44.1438 1.6060 13.8812 4.7667 1.7592 94.0429 5.9192 17.6372 57.8567 156.0050 128.7931 423.9761 285.3922 117.9523 31.6301 11.1357 56.7174 15.2057 12.6211 4.0366 23.6899 7.5628 26.2207 0.5979 24.8215 60.3224 91.0940 25.3115 172.8162 14.3848 75.3750 32.3014 89.7688 35.3275 29.1219 125.4546 292.8534 73.2904 381.5450 13.8333 13.0050 0.9300 18.0101 10.5689 9.6094 13.0591 2.7306 3.4639 0.1705 58.2640 58.5732
temp: 298.150 k
press: 1.00000 atm
elementType: 8 8 8 8 8 6 6 6 6 6 6 6 6 6 6 6 6 6 6 6 6 1 1 1 1 1 1 1 1 1 1 1 1
symmnumber: 1
zpe: 638672.8 jmol-1
zpe.correction: 0.243258 hartree
zpe.thermalcorrener: 0.259434 hartree
zpe.thermalcorrenthalpy: 0.260378 hartree
zpe.thermalcorrgfe: 0.199735 hartree
zpe.sumelectzpe: -991.550995 hartree
zpe.sumelectthermal: -991.534819 hartree
zpe.sumelectthermalent: -991.533874 hartree
zpe.sumelectthermalfe: -991.594518 hartree
dipole: -1.6707 -1.9344 4.4234
dipole: 5.1088
quadrupole: -99.4923 -123.3098 -129.1755
quadrupole: -9.7359 -1.7924 17.3515
quadrupole: 17.8336 -5.9839 -11.8496 -9.7359 -1.7924 17.3515
hfenergy: -991.7942528 hartree
pointgroup: C01 [X(C16H12O5)]
dipole: -0.6265786 0.8249012 -1.7224708 debye
polarizability: 265.4211056|-1.1823425|218.5469142|-1.5705412|8.3317907|97.9642204 unknown
InChI: InChI=1S/C16H12O5/c17-9-1-3-11-13(7-9)20-14-8-10(18)2-4-12(14)16(11)6-5-15(19)21-16/h1-4,7-8,17-18H,5-6H2
charge 0 multiplicity 1
33 atoms
O  -0.147652 -1.799759 0.977667
O  0.146693 2.079702 0.184355
O  -0.340783 -4.057473 1.455528
O  4.982752 1.851069 0.14489
O  -4.571317 2.715028 0.308144
C  -0.086068 -0.864792 -0.252415
C  -0.17406 -1.851921 -1.483963
C  1.23163 -0.121044 -0.166615
C  -1.271682 0.073637 -0.138698
C  -0.296241 -3.281536 -0.914928
C  1.293767 1.273941 0.058627
C  -1.115535 1.463793 0.091063
C  -0.268679 -3.147081 0.611634
C  2.469367 -0.81114 -0.266501
C  -2.598614 -0.419523 -0.207151
C  2.517205 1.969931 0.163454
C  -2.212059 2.33573 0.233081
C  3.703227 -0.154468 -0.161855
C  -3.716293 0.419086 -0.064273
C  3.721403 1.247892 0.052184
C  -3.513206 1.807952 0.156277
H  0.724112 -1.737356 -2.110007
H  -1.040643 -1.583804 -2.107929
H  0.529676 -3.948065 -1.219246
H  -1.233359 -3.790431 -1.201474
H  2.462927 -1.897426 -0.410562
H  -2.760355 -1.49326 -0.355382
H  2.495195 3.051907 0.332535
H  -2.052492 3.401938 0.406216
H  4.65119 -0.693652 -0.231316
H  -4.730029 0.003653 -0.112405
H  4.905572 2.823843 0.30746
H  -5.444946 2.253629 0.261404
