program: Gaussian 09
title: 000263044
version: EM64L-G09RevD.01
frameworkgroup: C1[X(C12H23NO4)]
method: RPBEPBE
basis: SDD
operation: Freq
keyword: #p
keyword: freq=noraman
keyword: PBEPBE/SDD
title: #p freq=noraman PBEPBE/SDD
converged: YES YES NO NO
title: Mulliken charges:
elementType: O O O O N C C C C C C C C C C C C H H H H H H H H H H H H H H H H H H H H H H H
charge: -0.268209 -0.268210 -0.246640 -0.246645 -0.279875 -0.352638 -0.352662 -0.393361 -0.393343 -0.497624 -0.497638 0.251750 0.251757 -0.263540 -0.263540 -0.663374 -0.663369 0.206060 0.172099 0.172115 0.206058 0.219257 0.228791 0.219262 0.228784 0.243864 0.231426 0.244948 0.244949 0.231426 0.233495 0.222337 0.222336 0.233496 0.215926 0.226596 0.250708 0.215925 0.250706 0.226596
chargesum: 0.00000
title: Mulliken charges with hydrogens summed into heavy atoms:
elementType: O O O O N C C C C C C C C C C C C
charge: -0.268209 -0.268210 -0.246640 -0.246645 -0.036010 0.025520 0.025511 0.054687 0.054704 -0.021250 -0.021263 0.251750 0.251757 0.192292 0.192292 0.029856 0.029859
polarizability: 2.12921258e+02 -2.14317898e-03 1.27074613e+02 4.65663885e-04 6.97781262e+00 1.24873609e+02
1716.lowfreq: -15.6923 -9.3943 -2.0086 -1.3550 -0.0013 -0.0012 0.0011 10.0076 22.8533
frequency: -9.3565 9.2823 22.8511 23.6291 39.0654 56.8088 62.4329 71.7762 74.8402 97.8659 110.6076 123.5568 142.9993 151.2813 157.9324 176.0263 208.7902 222.7952 274.9707 303.1193 305.1947 327.8607 377.9572 423.4699 427.6055 467.9797 489.4969 579.6298 590.4753 653.2400 663.6600 682.8581 753.1993 756.4656 783.1779 786.5211 814.2388 814.8701 857.4150 870.0912 892.9800 895.9352 1001.9424 1010.6555 1024.4054 1029.5327 1063.3235 1071.6555 1074.0367 1088.0184 1094.8630 1095.8054 1098.1759 1116.7359 1148.9565 1153.9566 1155.0599 1156.5266 1159.6095 1202.0865 1240.6813 1267.8319 1271.6968 1274.5495 1278.1195 1278.4493 1279.8065 1285.6765 1326.9671 1346.6237 1354.6702 1359.9643 1368.0426 1388.3466 1388.3729 1398.2460 1444.6465 1444.9097 1455.6036 1455.9428 1456.0193 1462.6631 1462.6706 1472.8530 1476.8276 1484.3377 1484.3757 1488.9394 1498.4023 1640.3914 1640.8958 2827.4556 2836.3460 2975.4720 2975.5668 2985.8153 2987.6867 2992.0325 2992.0512 2999.7180 3000.2464 3027.6200 3027.6511 3049.8378 3049.9573 3073.4616 3073.7229 3087.1308 3087.1617 3092.1797 3092.1832 3118.1731 3118.1885 3425.3876
redmass: 4.2266 4.1484 3.5711 3.6754 2.9384 2.8937 3.7309 3.2309 2.7371 1.9721 3.1676 3.6093 2.2613 2.4022 6.7345 2.5510 1.2502 1.3617 2.3299 4.9874 2.5680 3.7525 3.7852 3.4841 3.1396 3.1205 3.3744 3.3184 3.2462 2.1561 3.9564 1.7501 1.1577 1.1771 2.2053 2.0610 1.6039 1.6706 1.3571 1.4058 3.5221 3.6687 3.0005 2.8450 3.3249 3.6027 2.2664 2.0527 2.2661 2.8356 2.4906 2.1638 2.1265 1.8767 2.5455 2.3683 2.2281 1.7919 1.5924 1.4398 1.2877 1.2359 1.2106 1.3030 1.1088 1.1221 1.1041 1.1911 1.3694 1.3672 1.2957 1.4719 1.6472 1.2337 1.2336 1.5158 1.0858 1.0861 1.1853 1.0925 1.1188 1.0434 1.0433 1.0763 1.0796 1.0512 1.0513 1.0958 1.0851 9.0261 9.0507 1.0715 1.0713 1.0656 1.0657 1.0847 1.0830 1.0360 1.0360 1.0624 1.0625 1.0594 1.0594 1.0959 1.0958 1.1003 1.1003 1.0974 1.0974 1.1033 1.1033 1.1058 1.1058 1.0741
irintensity: 0.0895 0.7713 0.8521 0.5082 0.5291 2.4971 0.0312 0.8702 0.7886 0.8542 4.2723 0.0974 3.8429 2.9209 1.3399 6.5037 3.7691 0.4098 0.2962 18.7763 5.0794 12.7127 17.0619 0.4094 6.8561 0.3729 1.7319 4.2198 7.7196 38.2531 0.3211 75.8709 1.6429 22.8946 1.9590 10.3569 4.9242 2.0170 1.1047 1.3656 2.6754 34.7837 4.7130 57.0926 17.6139 112.9062 3.9446 2.0068 87.9463 1.9103 7.6759 54.7123 25.6229 208.8751 33.3932 11.7776 73.2874 21.1499 267.9020 7.1547 79.1939 29.8214 0.5957 2.9993 4.4446 1.9025 8.5823 4.7513 133.3075 2.5981 8.9428 2.2932 4.2190 2.1420 43.5027 0.8129 2.2500 34.5522 48.1101 16.8718 0.4375 10.0649 20.1206 0.6467 15.6760 14.6919 11.3264 7.3180 5.8209 8.2150 290.9367 56.0944 195.1467 8.7689 13.2991 0.0302 36.8643 12.1512 28.1821 3.9798 61.7075 46.3534 21.2168 0.0014 9.3672 1.4543 78.9797 54.4485 21.7124 0.8955 0.7269 19.4610 49.9192 0.8651
temp: 298.150 k
press: 1.00000 atm
elementType: 8 8 8 8 7 6 6 6 6 6 6 6 6 6 6 6 6 1 1 1 1 1 1 1 1 1 1 1 1 1 1 1 1 1 1 1 1 1 1 1
symmnumber: 1
zpe: 895182.7 jmol-1
zpe.correction: 0.340957 hartree
zpe.thermalcorrener: 0.361517 hartree
zpe.thermalcorrenthalpy: 0.362461 hartree
zpe.thermalcorrgfe: 0.286448 hartree
zpe.sumelectzpe: -825.338739 hartree
zpe.sumelectthermal: -825.318179 hartree
zpe.sumelectthermalent: -825.317235 hartree
zpe.sumelectthermalfe: -825.393247 hartree
dipole: 0.0002 -1.8377 -2.0468
dipole: 2.7507
quadrupole: -73.9147 -103.4521 -109.6704
quadrupole: -0.0033 0.0016 -4.9586
quadrupole: 21.7643 -7.7730 -13.9913 -0.0033 0.0016 -4.9586
hfenergy: -825.6796956 hartree
pointgroup: C01 [X(C12H23N1O4)]
dipole: 0.000432 0.9456373 0.526288 debye
polarizability: 212.9208875|0.0588078|128.0013303|-0.1755801|6.7668364|123.9472626 unknown
InChI: InChI=1S/C12H23NO4/c1-3-16-11(14)7-5-9-13-10-6-8-12(15)17-4-2/h13H,3-10H2,1-2H3
charge 0 multiplicity 1
40 atoms
O  -6.129868 0.679418 0.353288
O  6.130566 0.686112 0.329827
O  -5.079501 -1.328079 -0.209621
O  5.080256 -1.322662 -0.228612
N  0.000794 0.033318 0.370895
C  -1.244319 0.491818 1.018416
C  1.247792 0.493089 1.013877
C  -2.479645 -0.009898 0.247099
C  2.480779 -0.007245 0.237935
C  -3.795729 0.485159 0.883299
C  3.798746 0.489287 0.869079
C  -5.023283 -0.174294 0.276087
C  5.024658 -0.168873 0.25716
C  -7.423816 0.145542 -0.178143
C  7.422977 0.153669 -0.206769
C  -7.53764 0.40455 -1.682998
C  7.530467 0.412651 -1.712088
H  -1.233974 1.600869 1.026878
H  -1.324343 0.16779 2.089925
H  1.332093 0.169025 2.085042
H  1.236287 1.602126 1.022489
H  -2.489661 -1.116915 0.221657
H  -2.407785 0.33079 -0.802165
H  2.491949 -1.114252 0.212484
H  2.404538 0.333338 -0.811057
H  0.001073 -0.98802 0.234854
H  -3.79864 0.24521 1.967476
H  -3.903528 1.581263 0.806191
H  3.905064 1.585501 0.791501
H  3.806108 0.249372 1.953239
H  -7.47804 -0.9341 0.047727
H  -8.186398 0.695356 0.396503
H  8.187229 0.704416 0.364758
H  7.479352 -0.925889 0.01898
H  -8.531243 0.079748 -2.044224
H  -7.423033 1.479066 -1.907737
H  -6.769054 -0.161275 -2.235548
H  8.522975 0.08889 -2.077232
H  6.760304 -0.154086 -2.261495
H  7.413788 1.487016 -1.936477
