program: Gaussian 09
title: 000263042
version: EM64L-G09RevD.01
frameworkgroup: C1[X(C12H14Br2O)]
method: RPBEPBE
basis: SDD
operation: Freq
keyword: #p
keyword: freq=noraman
keyword: PBEPBE/SDD
title: #p freq=noraman PBEPBE/SDD
converged: NO YES NO NO
title: Mulliken charges:
elementType: Br Br O C C C C C C C C C C C C H H H H H H H H H H H H H H
charge: 0.044347 0.001892 -0.388494 -0.172499 -0.429427 -0.429255 -0.401544 -0.401739 -0.384979 0.476659 0.155092 -0.310604 -0.383842 -0.271796 -0.178777 0.137594 0.223131 0.205226 0.205301 0.223262 0.193235 0.209406 0.209490 0.193215 0.193769 0.206244 0.253535 0.272832 0.348729
chargesum: 0.00000
title: Mulliken charges with hydrogens summed into heavy atoms:
elementType: Br Br O C C C C C C C C C C C C
charge: 0.044347 0.001892 -0.039766 -0.034906 -0.001069 -0.000693 0.001096 0.000967 0.015035 0.476659 0.155092 -0.057069 -0.383842 -0.271796 0.094055
polarizability: 2.06560940e+02 -4.60435143e+00 1.95015654e+02 9.75466399e-02 4.08055585e-03 9.35895354e+01
1716.lowfreq: -15.2653 -0.0001 0.0001 0.0004 5.1131 9.0352 12.4750 60.4042 64.7068
frequency: 1.0362 60.3901 64.6896 96.6311 112.7407 143.8408 156.1335 208.2016 224.2746 250.9082 263.7517 280.7500 331.9051 347.1928 350.5265 358.8059 428.8057 434.6025 484.0040 545.9219 547.9503 561.3985 600.7745 676.7401 746.5751 776.4033 781.9008 803.8336 839.1310 868.9233 870.9660 880.8016 895.1641 903.0472 920.6542 994.2896 1047.6320 1049.1469 1069.8473 1073.1031 1101.4155 1111.1505 1131.5047 1164.4163 1183.3451 1233.5371 1243.0341 1251.6008 1257.5072 1274.6319 1288.3065 1303.1554 1321.9116 1335.3512 1342.3456 1347.0934 1354.9317 1389.2596 1396.6412 1440.7018 1459.7204 1462.2711 1463.4117 1469.6480 1477.7739 1555.3754 1598.3142 2892.8043 2964.7164 2965.3564 2969.0241 2974.5134 2977.8818 3029.6759 3032.4094 3036.2500 3039.3500 3047.6935 3158.2732 3183.8980 3554.6540
redmass: 3.4494 4.5554 4.9842 7.2680 15.5450 5.4936 3.5256 9.3594 1.7859 5.0620 3.9959 6.1498 3.2851 2.7703 1.1060 6.9967 3.0498 2.9783 1.6680 3.9110 4.5929 4.5513 4.5509 6.9326 6.0768 2.5456 1.4521 5.9538 2.8056 1.7196 1.4084 1.5100 1.3332 3.1949 2.0317 2.4579 1.2334 1.8024 1.3705 2.1009 2.0505 2.4481 1.9665 2.9519 1.4523 1.4246 1.3999 1.3596 1.6099 1.7000 1.2028 1.4598 1.3387 1.3709 1.4962 1.5600 1.8070 2.4296 4.0490 3.3324 1.0882 1.0973 1.0887 1.0825 1.0989 7.1186 7.6755 1.0804 1.0640 1.0668 1.0607 1.0609 1.0620 1.0964 1.0950 1.1001 1.1032 1.1037 1.0915 1.0933 1.0650
irintensity: 0.0817 0.0119 0.0330 0.0282 0.0428 1.9204 0.7192 0.5890 0.0070 4.0611 0.1730 1.3521 1.4627 0.8809 108.3403 0.0002 0.5201 3.0282 0.6891 6.4152 3.9488 4.8442 34.3561 44.2227 8.0813 1.7535 0.2890 4.9904 3.4631 19.0159 23.6556 16.5083 0.4922 22.7999 0.0518 15.1794 0.1785 2.0340 0.0481 40.5062 89.4903 0.0028 29.2079 124.3786 0.6531 3.5944 28.5586 1.1441 6.7724 14.5944 0.8115 6.5117 0.0569 0.2496 0.4761 6.6342 12.0211 18.9491 4.7110 143.9424 4.0785 13.5358 8.8251 23.1090 6.4126 34.5332 9.2078 42.6202 26.2609 41.9959 35.3758 13.7626 28.8896 79.7262 72.8948 2.6097 4.1507 104.9197 3.6429 0.1844 40.3922
temp: 298.150 k
press: 1.00000 atm
elementType: 35 35 8 6 6 6 6 6 6 6 6 6 6 6 6 1 1 1 1 1 1 1 1 1 1 1 1 1 1
symmnumber: 1
zpe: 603146.7 jmol-1
zpe.correction: 0.229726 hartree
zpe.thermalcorrener: 0.244633 hartree
zpe.thermalcorrenthalpy: 0.245577 hartree
zpe.thermalcorrgfe: 0.182398 hartree
zpe.sumelectzpe: -566.696294 hartree
zpe.sumelectthermal: -566.681388 hartree
zpe.sumelectthermalent: -566.680444 hartree
zpe.sumelectthermalfe: -566.743623 hartree
dipole: -4.6469 -0.3296 -0.0002
dipole: 4.6586
quadrupole: -99.2736 -112.7973 -110.5134
quadrupole: 5.2130 0.0160 0.0038
quadrupole: 8.2545 -5.2692 -2.9853 5.2130 0.0160 0.0038
hfenergy: -566.9260208 hartree
pointgroup: C01 [X(C12H14Br2O1)]
dipole: 1.832672 0.0088677 0.0231285 debye
polarizability: 205.8356101|-4.5116451|182.6926526|3.2453515|-34.07077|106.6378668 unknown
InChI: InChI=1S/C12H14Br2O/c13-9-6-10(12(15)11(14)7-9)8-4-2-1-3-5-8/h6-8,15H,1-5H2
charge 0 multiplicity 1
29 atoms
Br -3.842289 2.116626 -0.861926
Br -2.631222 -3.180394 1.175945
O  -0.808292 2.3358 -0.905929
C  1.317449 0.351526 -0.117209
C  2.02965 -0.616108 -1.107759
C  1.988783 0.293284 1.286417
C  3.54845 -0.33371 -1.183711
C  3.507434 0.573394 1.201737
C  4.205911 -0.392049 0.215158
C  -0.18777 0.087816 -0.041212
C  -1.150649 1.067905 -0.427364
C  -0.650799 -1.165669 0.42935
C  -2.534144 0.771546 -0.332059
C  -2.027249 -1.433348 0.514944
C  -2.988917 -0.474838 0.137815
H  1.510012 1.380613 -0.503868
H  1.56579 -0.532976 -2.109292
H  1.867328 -1.659446 -0.769141
H  1.826567 -0.713839 1.720898
H  1.495478 1.014321 1.966036
H  3.714353 0.671963 -1.623956
H  4.029015 -1.061546 -1.865194
H  3.959246 0.487717 2.208523
H  3.671465 1.61939 0.867418
H  4.137751 -1.427769 0.607929
H  5.283067 -0.148255 0.140773
H  0.072218 -1.930371 0.728604
H  -4.058935 -0.684097 0.204449
H  0.175501 2.443719 -0.933877
