program: Gaussian 09
title: 000263036
version: EM64L-G09RevD.01
frameworkgroup: C1[X(C10H14BrN)]
method: RPBEPBE
basis: SDD
operation: Freq
keyword: #p
keyword: freq=noraman
keyword: PBEPBE/SDD
title: #p freq=noraman PBEPBE/SDD
converged: YES YES NO NO
title: Mulliken charges:
elementType: Br N C C C C C C C C C C H H H H H H H H H H H H H H
charge: -0.029015 -0.164808 -0.395002 -0.400189 0.473558 -0.661447 -0.660068 -0.290450 -0.375511 -0.207355 -0.223785 -0.264690 0.221855 0.224272 0.222073 0.228078 0.239139 0.217806 0.214511 0.242740 0.216243 0.215812 0.251620 0.230548 0.224420 0.249645
chargesum: 0.00000
title: Mulliken charges with hydrogens summed into heavy atoms:
elementType: Br N C C C C C C C C C C
charge: -0.029015 -0.164808 0.051125 0.049962 0.473558 0.010009 0.014727 -0.038829 -0.144963 -0.207355 0.000635 -0.015045
polarizability: 1.89564441e+02 -8.03514244e-01 1.39627869e+02 6.77942336e-01 8.09393625e+00 7.35427704e+01
1716.lowfreq: -2.9330 -0.0002 0.0003 0.0004 6.9203 12.9323 42.9080 77.9420 86.0681
frequency: 42.8463 77.9192 86.0586 98.9147 153.1731 173.2842 192.1584 215.5931 223.3503 277.9211 309.7593 326.4231 399.1743 410.3787 445.0908 523.3276 530.9325 569.4281 646.7695 679.9239 732.1347 756.3148 786.8664 792.2514 835.0046 851.7653 903.2958 922.9500 956.4443 963.4375 1015.4646 1072.5976 1073.4534 1077.9674 1095.9080 1098.1211 1162.4903 1186.5760 1204.0610 1265.5346 1288.1212 1304.5841 1342.5344 1352.8998 1368.1041 1387.3693 1389.9777 1391.2775 1437.6865 1467.7126 1468.7361 1477.5190 1482.4102 1487.5786 1493.4655 1513.4799 1548.4082 1615.6872 2983.0401 2983.3553 2987.5747 2993.5882 3036.1878 3042.1332 3078.5810 3079.2021 3091.4658 3092.9327 3133.8186 3169.1932 3182.7480 3186.0814
redmass: 3.9279 3.4088 3.6338 2.9778 2.8296 4.6181 2.8760 1.0426 1.3209 5.7368 3.2564 2.7935 2.6894 3.5584 3.2766 2.8342 2.9807 4.7032 6.6467 1.9847 4.1110 1.4057 1.1295 1.2010 1.6693 1.3975 2.4308 2.1781 1.3344 5.1836 3.2319 2.1813 2.1571 1.7942 1.6400 1.6720 1.8900 1.1223 2.4128 1.3958 1.2006 1.3199 1.2697 1.3419 4.2700 1.4625 1.3110 1.4188 3.0585 1.0484 1.0447 1.0579 1.0853 2.0513 1.0858 1.2999 6.3378 6.5213 1.0359 1.0358 1.0602 1.0608 1.1029 1.1022 1.0995 1.0997 1.1010 1.1008 1.0877 1.0922 1.0930 1.0944
irintensity: 0.0261 1.3245 0.8840 0.0274 0.6948 0.9692 0.3795 0.3224 0.0531 2.8667 0.7632 0.3780 0.4336 8.8931 3.2708 0.9408 1.5505 1.9804 11.5637 24.8043 25.5075 57.2962 5.3662 30.2475 32.5248 0.0739 17.6225 1.4918 0.7950 37.8199 43.7532 10.0060 17.7833 20.9505 15.6489 12.0224 4.3474 6.9151 43.8202 46.4150 3.3950 4.2272 15.3390 68.3096 5.6124 12.0855 38.3707 21.7523 0.7406 7.6010 17.7645 0.2513 11.5037 130.9678 31.9332 42.8149 93.0228 326.3350 29.5480 24.9928 54.9015 36.3517 6.5835 16.9047 38.0633 49.9144 9.2550 75.8694 12.9716 18.1202 9.2178 1.9207
temp: 298.150 k
press: 1.00000 atm
elementType: 35 7 6 6 6 6 6 6 6 6 6 6 1 1 1 1 1 1 1 1 1 1 1 1 1 1
symmnumber: 1
zpe: 568181.4 jmol-1
zpe.correction: 0.216409 hartree
zpe.thermalcorrener: 0.229246 hartree
zpe.thermalcorrenthalpy: 0.230190 hartree
zpe.thermalcorrgfe: 0.176031 hartree
zpe.sumelectzpe: -456.753823 hartree
zpe.sumelectthermal: -456.740986 hartree
zpe.sumelectthermalent: -456.740042 hartree
zpe.sumelectthermalfe: -456.794201 hartree
dipole: -4.4841 0.3389 -0.0815
dipole: 4.4977
quadrupole: -76.2248 -74.9491 -86.4916
quadrupole: -2.5036 -0.0489 2.3007
quadrupole: 2.9971 4.2727 -7.2698 -2.5036 -0.0489 2.3007
hfenergy: -456.970232 hartree
pointgroup: C01[X(C10H14Br1N1)]
dipole: 1.7397094 0.3140755 -0.0772006 debye
dipolederiv: -0.4879379 -0.2857512 0.0566162 -0.382993 -0.3842188 0.062068 0.0705415 0.0614109 -0.0800492 -1.6486956 0.1939778 -0.0781451 0.271052 -0.6966143 -0.1060517 -0.0619391 -0.0168405 -0.3494576 0.6150063 0.2443944 0.036922 0.4702279 0.3641512 0.0503893 -0.0851982 0.0630985 0.2620211 0.2179786 -0.1441515 -0.0051174 -0.3929722 0.68139 0.0307928 0.1139812 0.003485 0.2669207 1.7331684 -0.4301295 0.0701527 -0.4344553 0.0979853 0.0144449 0.0805352 0.0340935 0.1276137 -0.0322592 -0.0291026 -0.041467 -0.1160201 -0.0190845 -0.074731 -0.0449235 -0.1258119 -0.0686547 0.0413753 0.0040135 0.0022574 0.0903939 -0.0757134 -0.0796438 -0.0234502 -0.130984 -0.0644392 -0.8147697 0.1066614 -0.0275191 -0.4736734 -0.1358365 0.0153839 0.1122159 -0.0139969 -0.1922223 -0.4010404 0.0000385 0.025753 0.5393705 -0.1285603 -0.0129114 -0.114986 -0.0076157 -0.2390063 1.0138659 0.3203824 -0.0673798 0.5971157 0.8255485 -0.1878678 -0.1125312 -0.1711842 -0.0591868 0.4662595 0.2069353 -0.0508256 -0.0559865 0.1402137 -0.0575018 0.0002243 -0.0501886 -0.1157617 -0.4716052 -0.2282805 0.0459807 -0.1815392 -0.5055324 0.0697354 0.0295781 0.0613698 -0.1930939 -0.1427358 0.0540844 0.066153 0.0859428 -0.0085897 -0.0988018 0.0420351 -0.0680364 0.0403739 0.0567951 0.027091 -0.1013295 -0.0747495 -0.0512867 0.0964748 -0.0356153 0.0660442 -0.0728109 -0.1562569 0.0301642 -0.1229573 0.0173848 0.0256992 -0.0482819 -0.0872447 -0.0319927 0.0273574 0.0312568 -0.0776475 0.1455112 0.0118485 -0.0373055 0.0253311 0.0764224 0.0313958 -0.0563022 -0.0142841 0.1173174 0.0778538 0.0938159 0.0240026 -0.0548165 0.058314 -0.0267348 0.0560334 0.0683366 0.0279695 -0.0584052 0.0858532 -0.0034308 0.1234779 -0.0651062 0.0718127 -0.0484449 -0.1081915 -0.1431713 0.0298433 -0.1861262 -0.0237534 0.0165415 0.0387166 0.0397875 0.0592478 -0.084286 -0.0381137 -0.1038264 -0.0220036 0.097751 -0.004661 -0.0772735 -0.002561 0.0445333 -0.0227053 -0.030023 0.1197364 -0.0899418 0.0662276 0.0640279 0.0979172 0.0222278 -0.0345116 0.0644922 0.075314 -0.0161461 0.1308295 -0.1758354 0.043729 -0.0141661 0.0682238 0.0547656 0.1042166 0.0396006 -0.0083305 0.053135 -0.0488741 0.0271131 -0.0132661 0.031951 0.1542064 -0.0292993 -0.1122791 0.015376 -0.1136643 -0.0008176 0.0192874 0.018011 0.0231178 0.1563593 0.0547568 0.0242117 -0.0042839 0.041176 -0.1196019 0.0506986 -0.0022565 0.0501498 0.1432184 -0.0534412 0.0464938 -0.0064229 0.0359793 0.0920865 0.0157733 -0.000536 0.0177788 0.18129 unknown
polarizability: 186.8000362|11.2262573|142.400377|-1.5675086|-8.2447643|73.5346675 unknown
InChI: InChI=1S/C10H14BrN/c1-3-12(4-2)10-7-5-6-9(11)8-10/h5-8H,3-4H2,1-2H3
charge 0 multiplicity 1
26 atoms
Br -3.650932 -1.681412 0.330826
N  1.496673 -0.193241 0.01088
C  2.592589 0.747199 -0.296481
C  1.882758 -1.567746 0.386145
C  0.155264 0.201801 -0.053689
C  3.047818 1.591537 0.917941
C  1.908744 -2.555235 -0.805343
C  -0.903202 -0.748613 0.131586
C  -0.2179 1.562796 -0.306718
C  -2.239528 -0.324638 0.068616
C  -1.571543 1.940778 -0.371516
C  -2.619134 1.007542 -0.182732
H  3.448807 0.155751 -0.672442
H  2.289168 1.407974 -1.130066
H  2.889065 -1.521988 0.843721
H  1.205385 -1.939325 1.177835
H  2.216082 2.19933 1.314373
H  3.40951 0.94072 1.734626
H  3.871307 2.271957 0.630839
H  0.915956 -2.633628 -1.281431
H  2.627063 -2.220069 -1.575397
H  2.21248 -3.563492 -0.467101
H  -0.688324 -1.804075 0.307274
H  0.546899 2.332386 -0.438847
H  -1.823024 2.989955 -0.564293
H  -3.668681 1.306037 -0.227907
