program: Gaussian 09
title: 000024337
version: EM64L-G09RevD.01
frameworkgroup: C1[X(C21H23NO2)]
method: RPBEPBE
basis: SDD
operation: Freq
keyword: #p
keyword: freq=noraman
keyword: PBEPBE/SDD
title: #p freq=noraman PBEPBE/SDD
converged: YES YES NO NO
title: Mulliken charges:
elementType: O O N C C C C C C C C C C C C C C C C C C C C C H H H H H H H H H H H H H H H H H H H H H H H
charge: -0.275303 -0.319512 -0.056081 -0.159140 -0.158087 -0.166540 -0.153594 -0.490691 -0.518241 0.048413 -0.646106 -0.278208 0.363657 0.486819 -0.386299 -0.455374 -0.427263 -0.359458 -0.229434 -0.225888 -0.218260 -0.228345 -0.248154 -0.242257 0.244434 0.247090 0.244195 0.248057 0.205652 0.238807 0.235829 0.224440 0.225980 0.229970 0.193700 0.230136 0.208735 0.241208 0.231016 0.277649 0.256152 0.224234 0.227897 0.223475 0.227940 0.226573 0.230176
chargesum: 0.00000
title: Mulliken charges with hydrogens summed into heavy atoms:
elementType: O O N C C C C C C C C C C C C C C C C C C C C C
charge: -0.275303 -0.319512 -0.056081 0.085295 0.089003 0.077655 0.094463 -0.046233 -0.057973 0.274393 0.007700 -0.069473 0.363657 0.486819 -0.145091 -0.224358 -0.149614 -0.103306 -0.005199 0.002009 0.005214 -0.000405 -0.021581 -0.012081
polarizability: 2.40060998e+02 8.64198000e+00 2.49047421e+02 -2.27268130e+00 -1.41460034e+01 1.82908050e+02
1716.lowfreq: -10.0083 -0.0008 -0.0006 -0.0006 2.8417 8.4563 15.3146 25.6663 28.8675
frequency: 13.3304 25.4077 28.7800 32.6318 55.3523 61.2843 90.0735 135.3750 154.6249 203.4952 207.4157 216.4864 228.9954 238.3653 279.4836 286.3466 299.0156 309.7697 357.9961 399.1894 402.3082 404.3871 430.0080 458.5548 462.1617 474.7187 522.0593 547.3942 607.7535 611.4778 615.3432 617.6201 639.6214 691.1379 705.7104 706.6834 739.9061 741.1290 765.0898 773.1364 775.5642 814.5063 826.2139 851.8445 856.4541 858.1374 860.3440 869.1206 872.5700 916.4099 932.6652 939.1022 953.7012 960.6093 965.8625 978.9840 984.4555 989.8589 990.6843 995.7934 998.9282 999.9060 1018.1139 1020.6398 1025.4156 1028.7004 1050.4265 1064.4956 1079.8454 1083.4886 1110.2616 1119.2486 1123.4970 1169.0445 1170.5681 1172.6464 1179.6590 1184.6443 1186.9893 1189.2954 1202.8364 1210.9441 1213.1665 1233.6868 1239.9276 1251.4370 1267.3539 1286.9131 1294.6974 1312.0335 1314.6918 1319.4095 1329.8226 1335.8973 1347.3444 1353.1851 1360.2206 1382.7472 1386.0524 1433.2730 1434.6816 1442.3695 1456.2933 1460.1314 1480.1221 1481.7902 1482.4988 1492.6473 1591.5427 1594.3933 1609.9160 1614.6391 2862.9035 2928.8922 2972.8896 2981.3815 2997.1900 3010.9082 3032.1400 3038.4127 3041.6101 3056.3840 3069.0418 3108.6167 3118.8180 3125.9692 3126.6934 3131.6008 3137.4795 3140.3702 3148.9970 3149.8911 3158.1247 3164.0182 3178.6422
redmass: 4.0492 3.7560 5.2026 3.8638 5.0827 4.4135 4.3132 4.9818 4.1331 1.3683 2.6798 3.2070 2.5535 4.0730 4.4224 3.2389 3.8757 4.7873 2.8979 3.0136 2.8200 2.8672 7.0509 4.1180 3.6782 3.2086 4.7106 4.0570 4.9721 4.2097 6.3214 6.2877 4.6337 4.2741 2.0217 1.6848 4.1550 1.9706 3.0496 2.2426 5.4471 2.9778 3.3816 2.4291 1.3144 2.2907 1.3234 2.2170 1.9998 2.6444 1.8448 1.6299 1.6174 2.5389 1.5197 1.3895 1.3834 5.8453 6.1727 3.3322 1.4878 1.3558 2.5863 3.2194 2.2769 2.1653 1.2619 1.7388 1.5881 1.5918 2.8678 1.1318 1.3749 2.0093 1.0791 1.0740 1.7997 1.1209 1.5694 1.4413 1.7704 1.9005 1.5413 1.5689 1.5405 1.2785 1.6866 1.3031 1.4917 1.4132 1.5622 1.3117 2.6890 1.2907 1.4436 1.4243 2.0553 8.0112 6.7838 1.1332 2.2187 2.1163 1.0841 1.0821 2.2619 2.3119 1.0797 1.0517 6.2363 6.1486 6.0521 6.1128 1.0576 1.0816 1.0841 1.0602 1.0601 1.0722 1.0864 1.0892 1.1017 1.1025 1.1003 1.0882 1.0851 1.0857 1.0882 1.0877 1.0909 1.0939 1.0958 1.0992 1.0992 1.1014 1.0950
irintensity: 0.0513 0.0313 0.1788 0.0076 0.3099 0.6137 1.9370 0.6919 5.0245 0.3322 0.5627 3.2846 2.0586 0.4339 6.2806 3.2672 1.2649 3.3842 0.4202 3.2894 0.2231 0.7987 4.5497 10.1950 2.8533 6.3282 1.5221 9.8360 16.2619 0.8889 2.5497 0.6202 10.6107 38.3016 44.1912 46.0434 7.0844 53.3402 21.5267 37.6251 1.8014 66.8871 2.6691 2.5203 0.9411 4.4772 0.3719 0.4599 0.3586 11.8410 10.9217 2.5681 11.4897 43.7076 12.1889 0.0581 0.2742 5.7547 0.5490 48.2029 6.2701 3.1889 71.4637 75.1381 14.4763 7.2223 1.6229 22.4063 4.3080 13.7942 5.8002 0.9900 0.1805 16.7276 1.2037 0.8674 10.1491 1.1780 16.7530 3.6492 5.0502 1.8921 16.6649 5.6480 28.4700 0.0744 9.6217 18.3292 1.7623 9.3180 3.5835 4.6367 11.8691 3.0051 10.4781 5.5004 13.5354 0.6861 0.4375 11.4771 10.5463 10.9628 13.1882 7.4647 4.5083 28.7383 16.6597 2.4964 1.5172 0.2128 2.9937 7.6685 97.2201 24.5789 22.1584 34.6442 21.3278 62.8272 64.2727 27.1843 19.7937 29.9764 24.1068 10.8423 3.3783 0.0079 3.5968 11.8245 14.7352 33.8777 28.8155 19.7700 34.5872 23.4389 7.8036
temp: 298.150 k
press: 1.00000 atm
elementType: 8 8 7 6 6 6 6 6 6 6 6 6 6 6 6 6 6 6 6 6 6 6 6 6 1 1 1 1 1 1 1 1 1 1 1 1 1 1 1 1 1 1 1 1 1 1 1
symmnumber: 1
zpe: 1020450.2 jmol-1
zpe.correction: 0.388669 hartree
zpe.thermalcorrener: 0.409166 hartree
zpe.thermalcorrenthalpy: 0.410111 hartree
zpe.thermalcorrgfe: 0.336748 hartree
zpe.sumelectzpe: -1017.408414 hartree
zpe.sumelectthermal: -1017.387917 hartree
zpe.sumelectthermalent: -1017.386973 hartree
zpe.sumelectthermalfe: -1017.460335 hartree
dipole: -2.6962 0.4762 -0.3532
dipole: 2.7606
quadrupole: -166.8003 -129.4060 -132.8159
quadrupole: -6.7831 1.4535 -2.2209
quadrupole: -23.7929 13.6014 10.1915 -6.7831 1.4535 -2.2209
hfenergy: -1017.7970832 hartree
pointgroup: C01 [X(C21H23N1O2)]
dipole: -1.068959 0.0347059 -0.1891002 debye
polarizability: 238.4801999|8.0075551|238.6241969|-1.3013323|-29.4322469|194.9120722 unknown
InChI: InChI=1S/C21H23NO2/c1-22-17-12-16(13-18(22)21-20(17)24-21)23-19(14-8-4-2-5-9-14)15-10-6-3-7-11-15/h2-11,16-21H,12-13H2,1H3
charge 0 multiplicity 1
47 atoms
O  4.989391 1.443318 -0.279491
O  -0.103448 -0.653349 0.614546
N  4.032142 -0.962818 0.310864
C  3.665293 1.026688 -0.871884
C  3.757058 1.34846 0.58804
C  3.420584 -0.490614 -0.955175
C  3.561513 0.013342 1.327476
C  1.867765 -0.719986 -0.94601
C  2.029701 -0.160714 1.596853
C  1.20496 -0.036794 0.288948
C  3.989254 -2.390304 0.627723
C  -1.181024 -0.401387 -0.3692
C  -2.380864 -1.255291 0.055817
C  -1.499379 1.091577 -0.474466
C  -3.633254 -1.068655 -0.58319
C  -1.31083 1.785719 -1.693307
C  -2.253999 -2.263635 1.041196
C  -1.966807 1.803675 0.659749
C  -4.73924 -1.878632 -0.245872
C  -1.589649 3.169927 -1.786382
C  -3.364146 -3.070005 1.383531
C  -2.24069 3.184574 0.57272
C  -4.608929 -2.884369 0.740653
C  -2.054357 3.872292 -0.651907
H  3.250912 1.700997 -1.628311
H  3.418296 2.288255 1.035611
H  3.893271 -0.979273 -1.825802
H  4.147037 -0.078301 2.259242
H  1.420647 -0.337831 -1.884898
H  1.667674 -1.808055 -0.903754
H  1.853465 -1.162146 2.032449
H  1.660961 0.580491 2.330544
H  1.039135 1.036172 0.061856
H  4.469278 -2.956602 -0.191313
H  2.969406 -2.820401 0.784675
H  4.574337 -2.573346 1.547495
H  -0.844691 -0.753527 -1.370369
H  -3.745686 -0.280212 -1.33712
H  -0.949628 1.240832 -2.575643
H  -1.287714 -2.399619 1.533249
H  -2.111444 1.26506 1.603095
H  -5.701057 -1.722837 -0.747646
H  -1.443933 3.69618 -2.736464
H  -3.255293 -3.844726 2.151407
H  -2.603317 3.72681 1.453361
H  -5.467412 -3.511971 1.005582
H  -2.271289 4.944326 -0.719278
