program: Gaussian 09
title: 000263038
version: EM64L-G09RevD.01
frameworkgroup: C1[X(C10H18O5)]
method: RPBEPBE
basis: SDD
operation: Freq
keyword: #pfreq=noraman
keyword: PBEPBE/SDD
title: #p freq=noraman PBEPBE/SDD
converged: YES YES NO NO
title: Mulliken charges:
elementType: O O O O O C C C C C C C C C C H H H H H H H H H H H H H H H H H H
charge: -0.278058 -0.398010 -0.412586 -0.286659 -0.256513 -0.140832 -0.117339 -0.316398 -0.321899 -0.388143 -0.390559 0.201976 0.166179 -0.690926 -0.692361 0.252630 0.250505 0.236551 0.194994 0.224690 0.206118 0.205164 0.225985 0.223408 0.201425 0.217076 0.227676 0.219383 0.232673 0.213556 0.216599 0.374612 0.399084
chargesum: 0.00000
title: Mulliken charges with hydrogens summed into heavy atoms:
elementType: O O O O O C C C C C C C C C C
charge: -0.278058 -0.023398 -0.013502 -0.286659 -0.256513 0.111798 0.133165 0.115146 0.108909 0.043006 0.034273 0.201976 0.166179 -0.026791 -0.029533
polarizability: 1.45162844e+02 1.25883031e+00 1.16407546e+02 1.59185339e+00 -3.53505269e+00 1.07934964e+02
1716.lowfreq: -16.3753 -9.8740 0.0004 0.0007 0.0009 9.0413 27.3903 34.9676 52.4446
frequency: 26.7037 34.6480 52.3981 57.4039 64.0773 69.0595 85.9713 119.3476 132.7041 140.3953 173.3682 176.8659 212.3679 226.2022 255.9251 267.9818 274.0136 330.0722 377.6662 401.8039 443.5318 462.4534 501.6917 563.1272 591.1592 600.0355 619.5209 706.1826 721.0110 741.4423 747.4403 819.5428 820.5105 863.2530 914.9489 929.2303 975.9890 994.8236 999.4531 1035.3933 1051.3806 1061.8266 1073.5380 1077.8283 1083.4222 1111.0313 1114.4573 1131.4770 1144.3562 1210.6952 1223.9712 1240.2827 1245.9898 1265.8502 1272.3776 1276.1649 1285.3881 1331.0156 1333.0112 1342.3818 1380.7437 1389.0718 1390.6254 1394.9624 1398.6379 1459.3332 1466.6504 1468.0096 1477.9178 1478.5168 1482.0280 1482.6328 1490.4560 1642.2608 1647.4702 2949.9656 2976.4288 2980.3134 2982.0679 2983.1386 2987.0404 3022.5968 3030.8735 3036.4868 3044.5460 3060.6106 3063.3254 3079.2194 3079.8212 3081.4293 3082.8210 3468.1519 3501.5377
redmass: 4.5270 4.0084 4.0060 4.3590 4.1328 2.4137 4.3394 4.0935 4.2961 4.0940 1.9952 2.3020 2.0631 1.6071 2.3317 2.4121 2.8250 2.9693 3.2543 3.0110 4.5465 4.1486 3.2984 1.6414 3.1038 2.1636 1.3228 3.8480 3.6620 1.8913 1.9308 1.6310 1.6696 4.8140 1.6800 1.7690 1.8165 2.0634 2.7764 3.3777 3.4724 2.3100 2.8636 2.1916 2.3323 1.8719 1.8648 2.4067 2.5631 1.1557 1.2099 1.4159 1.3313 1.4526 1.1545 1.1643 1.3645 1.4067 1.3610 1.2737 1.4244 1.7362 1.3932 1.3354 1.2208 1.0813 1.0728 1.0789 1.0464 1.0490 1.0528 1.0548 1.0821 7.5053 7.6178 1.0596 1.0579 1.0376 1.0580 1.0359 1.0598 1.1014 1.0976 1.0986 1.0975 1.0901 1.0980 1.0999 1.1001 1.0998 1.1003 1.0637 1.0637
irintensity: 1.5959 1.0006 0.8650 1.7017 1.3737 0.6161 2.9689 2.4752 15.6413 4.8746 0.8270 4.2699 2.9447 1.2439 3.4546 2.5474 2.2007 2.3484 5.1348 4.5390 16.7893 8.6158 27.3980 227.5501 13.6451 105.7249 121.4652 18.6107 31.2752 10.8016 21.0461 2.0845 3.7615 15.6479 4.4893 5.3514 44.1244 33.0473 2.1717 44.4284 95.4252 233.7914 36.7223 73.2635 96.4934 0.3129 6.7417 8.1770 53.3157 3.9250 9.0705 3.4713 3.7352 6.7878 2.1394 2.1414 8.1094 9.9093 4.6854 3.7366 35.6135 20.2726 13.4605 19.6260 15.6573 0.8933 9.0504 14.0488 12.8232 11.2680 10.7620 11.9646 19.9227 249.0691 103.4091 52.9476 13.6130 45.3147 53.0482 30.2344 32.1658 8.9373 5.1495 2.0698 8.1309 8.7397 20.4679 49.8066 55.8937 46.7645 51.7159 79.1526 22.3458
temp: 298.150 k
press: 1.00000 atm
elementType: 8 8 8 8 8 6 6 6 6 6 6 6 6 6 6 1 1 1 1 1 1 1 1 1 1 1 1 1 1 1 1 1 1
symmnumber: 1
zpe: 716957.0 jmol-1
zpe.correction: 0.273075 hartree
zpe.thermalcorrener: 0.291104 hartree
zpe.thermalcorrenthalpy: 0.292048 hartree
zpe.thermalcorrgfe: 0.225186 hartree
zpe.sumelectzpe: -766.776320 hartree
zpe.sumelectthermal: -766.758291 hartree
zpe.sumelectthermalent: -766.757347 hartree
zpe.sumelectthermalfe: -766.824208 hartree
dipole: 0.8507 -1.2681 -1.1926
dipole: 1.9375
quadrupole: -80.3053 -82.8051 -98.5032
quadrupole: 2.6246 4.8266 -3.7617
quadrupole: 6.8993 4.3994 -11.2987 2.6246 4.8266 -3.7617
hfenergy: -767.0493944 hartree
pointgroup: C01 [X(C10H18O5)]
dipole: 0.3486871 0.5965472 0.3218913 debye
polarizability: 145.021523|-2.7870797|114.0062353|-0.1157982|-5.3211626|110.4775955 unknown
InChI: InChI=1S/C10H18O5/c1-3-7(9(11)12)5-15-6-8(4-2)10(13)14/h7-8,11,13H,3-6H2,1-2H3
charge 0 multiplicity 1
33 atoms
O  0.015915 1.550652 0.709427
O  2.303357 -0.766006 2.158586
O  -1.320912 -1.493089 0.565763
O  1.437941 -1.564664 0.16654
O  -1.536437 -0.541055 -1.541964
C  2.273931 0.766349 0.283877
C  -2.318677 0.709202 0.433479
C  1.020298 1.391167 -0.356286
C  -1.337294 1.896932 0.2373
C  3.423955 0.669975 -0.764107
C  -3.726896 1.070697 -0.106898
C  1.942645 -0.61891 0.820556
C  -1.721411 -0.483786 -0.301869
C  4.753258 0.149644 -0.178571
C  -4.786207 -0.01165 0.190531
H  2.593709 1.392646 1.134751
H  -2.369289 0.462115 1.508203
H  0.63799 0.739608 -1.166938
H  1.285786 2.382633 -0.781411
H  -1.678862 2.756291 0.843108
H  -1.321036 2.188144 -0.832643
H  3.578297 1.681438 -1.188393
H  3.094086 0.016336 -1.594664
H  -3.655668 1.233706 -1.20003
H  -4.040014 2.032511 0.346282
H  5.097732 0.784114 0.658588
H  4.653235 -0.883135 0.201766
H  5.542632 0.145713 -0.951479
H  -4.519647 -0.972723 -0.285845
H  -4.883793 -0.189246 1.277509
H  -5.7765 0.290414 -0.195479
H  2.056903 -1.679708 2.470995
H  -0.674029 -2.099818 0.105816
