program: Gaussian 09
title: 000263037
version: EM64L-G09RevD.01
frameworkgroup: C1[X(C10H16Br2O4)]
method: RPBEPBE
basis: SDD
operation: Freq
keyword: #p
keyword: freq=noraman
keyword: PBEPBE/SDD
title: #p freq=noraman PBEPBE/SDD
converged: YES YES NO NO
title: Mulliken charges:
elementType: Br Br O O O O C C C C C C C C C C H H H H H H H H H H H H H H H H
charge: 0.068915 0.068785 -0.275968 -0.276100 -0.182856 -0.183128 -0.602968 -0.602547 -0.261642 -0.261619 -0.355422 -0.354876 0.368869 0.368174 -0.678802 -0.678471 0.346337 0.346222 0.222749 0.231234 0.222973 0.231433 0.219708 0.242687 0.219232 0.241946 0.209017 0.230370 0.218094 0.209002 0.230312 0.218340
chargesum: 0.00000
title: Mulliken charges with hydrogens summed into heavy atoms:
elementType: Br Br O O O O C C C C C C C C C C
charge: 0.068915 0.068785 -0.275968 -0.276100 -0.182856 -0.183128 -0.256632 -0.256325 0.192341 0.192788 0.106974 0.106301 0.368869 0.368174 -0.021321 -0.020817
polarizability: 1.83964127e+02 -1.03958616e+01 1.32653814e+02 -9.43990938e-02 -4.77953413e-02 1.38446360e+02
1716.lowfreq: -3.0212 -0.0005 -0.0004 -0.0001 5.5729 7.3218 20.4643 27.4463 29.7136
frequency: 20.4339 27.4068 29.6987 35.2570 49.8427 60.2734 65.6520 81.7001 84.1946 98.8083 111.7518 112.7002 165.4507 216.4826 222.6266 223.4140 238.2401 274.1303 276.7229 288.5893 304.8795 321.0553 404.8667 458.4795 491.7928 508.5537 635.0672 651.5803 658.9910 722.5324 758.7975 762.7749 772.5079 817.9985 838.7048 884.3042 888.5805 899.1266 902.3348 951.7473 960.7594 1044.4690 1045.0348 1045.2982 1096.2286 1117.9540 1124.6197 1132.2864 1151.6065 1159.8355 1160.8976 1202.1473 1242.0525 1246.7307 1248.5804 1259.0617 1290.6186 1291.2208 1308.7301 1309.0102 1367.1544 1367.1906 1395.4254 1395.8901 1456.2816 1456.5547 1476.4661 1476.5319 1480.6836 1480.8041 1487.3137 1487.5417 1664.9751 1668.6828 2980.7858 2980.8809 3004.5379 3004.6733 3025.4401 3025.9492 3050.5189 3052.6004 3052.7614 3056.1840 3078.3824 3078.3945 3087.0961 3087.1067 3108.9402 3109.1114
redmass: 4.8661 3.8363 4.3916 6.2587 6.0411 3.1196 3.6972 2.6724 2.1379 22.3053 7.0636 5.5286 5.6605 3.3417 1.1279 1.3052 6.0730 3.9813 3.3873 3.6001 4.2843 7.2851 6.8148 5.4839 6.6618 8.7666 4.9619 4.6813 5.7502 3.9213 1.1055 1.1937 5.0980 4.4746 4.6289 1.5350 1.3222 1.5718 1.8997 5.0632 5.5841 3.5982 3.0640 3.0657 3.5665 2.2663 2.2977 2.1362 1.4204 1.6726 1.6825 1.4359 1.2174 1.2240 1.2181 1.7841 1.1041 1.1043 1.2911 1.2906 1.3639 1.3622 1.2019 1.2019 1.0928 1.0925 1.0515 1.0522 1.0420 1.0425 1.0836 1.0838 11.1522 10.9423 1.0361 1.0361 1.0606 1.0607 1.0580 1.0579 1.0818 1.1008 1.1007 1.0833 1.1020 1.1020 1.0989 1.0989 1.1084 1.1085
irintensity: 0.6492 0.0672 0.1873 0.7492 0.2389 0.7478 0.4685 0.5534 0.2485 0.0216 0.5328 0.2266 0.0788 0.0086 0.1412 0.1031 0.7434 7.2144 0.6601 1.1820 21.2234 1.6440 11.6549 12.3096 4.1950 12.8742 23.9584 0.8981 7.3193 0.2608 7.2675 7.5374 42.7234 10.1032 3.0204 13.6521 3.3762 1.5287 38.6216 176.0854 50.0993 6.8567 13.1387 5.6550 445.2858 59.9298 20.3117 101.7361 26.6951 6.1036 0.7578 94.4816 56.7206 2.0851 8.8319 2.4905 2.0978 2.1311 6.5729 2.8669 0.7915 0.4960 11.3092 10.7622 7.2544 10.2629 6.8203 4.3568 13.8732 13.6577 16.8721 17.2568 76.8059 200.1870 56.4477 14.2626 8.4692 12.4718 44.8854 44.1214 17.2911 1.0283 1.0959 0.0514 31.6659 32.4086 27.5376 38.6148 29.4507 31.1118
temp: 298.150 k
press: 1.00000 atm
elementType: 35 35 8 8 8 8 6 6 6 6 6 6 6 6 6 6 1 1 1 1 1 1 1 1 1 1 1 1 1 1 1 1
symmnumber: 1
zpe: 653161.4 jmol-1
zpe.correction: 0.248776 hartree
zpe.thermalcorrener: 0.268814 hartree
zpe.thermalcorrenthalpy: 0.269758 hartree
zpe.thermalcorrgfe: 0.194690 hartree
zpe.sumelectzpe: -717.202149 hartree
zpe.sumelectthermal: -717.182111 hartree
zpe.sumelectthermalent: -717.181167 hartree
zpe.sumelectthermalfe: -717.256234 hartree
dipole: -0.0145 -0.0365 4.9224
dipole: 4.9226
quadrupole: -90.6518 -123.6322 -111.2626
quadrupole: -6.7916 -0.0374 -0.0972
quadrupole: 17.8637 -15.1166 -2.7471 -6.7916 -0.0374 -0.0972
hfenergy: -717.4509246 hartree
pointgroup: C01 [X(C10H16Br2O4)]
dipole: -0.0160051 -1.9352708 0.0722666 debye
polarizability: 181.7487558|-0.7585277|138.4489338|-14.7058315|-0.0509919|134.8666113 unknown
InChI: InChI=1S/C10H16Br2O4/c1-3-5-15-9(13)7(11)8(12)10(14)16-6-4-2/h7-8H,3-6H2,1-2H3
charge 0 multiplicity 1
32 atoms
Br -0.576421 1.486153 1.67516
Br 0.588802 1.341503 -1.808874
O  2.180588 -1.303461 0.242309
O  -2.208575 -1.285119 -0.162043
O  2.423148 0.527644 1.675222
O  -2.422176 0.424391 -1.742507
C  0.193556 -0.11069 0.737355
C  -0.203719 -0.165948 -0.74937
C  3.657651 -1.56415 0.299181
C  -3.687687 -1.536231 -0.210366
C  4.401755 -0.715719 -0.739656
C  -4.42892 -0.616152 0.767568
C  1.715173 -0.199088 0.957527
C  -1.726195 -0.250205 -0.964733
C  5.907579 -1.061798 -0.756643
C  -5.939955 -0.938767 0.789248
H  -0.286851 -0.9736 1.231942
H  0.263325 -1.071729 -1.175465
H  3.736303 -2.642822 0.085888
H  4.01076 -1.34785 1.323691
H  -3.777848 -2.598285 0.070963
H  -4.033605 -1.38241 -1.248456
H  3.958431 -0.891983 -1.737597
H  4.262264 0.35434 -0.501706
H  -3.998583 -0.738122 1.779179
H  -4.271105 0.43553 0.467003
H  6.076505 -2.124766 -1.012182
H  6.436414 -0.447968 -1.506545
H  6.376552 -0.868167 0.225901
H  -6.127292 -1.982502 1.104353
H  -6.466436 -0.274773 1.496877
H  -6.396735 -0.795955 -0.207624
