program: Gaussian 09
title: 000262997
version: EM64L-G09RevD.01
frameworkgroup: C1[X(C14H13ClO)]
method: RPBEPBE
basis: SDD
operation: Freq
keyword: #p
keyword: freq=noraman
keyword: PBEPBE/SDD
title: #p freq=noraman PBEPBE/SDD
converged: YES YES NO NO
title: Mulliken charges:
elementType: Cl O C C C C C C C C C C C C C C H H H H H H H H H H H H H
charge: -0.070864 -0.292888 -0.179522 0.457063 -0.710105 -0.435895 -0.361268 0.390237 -0.220169 -0.227787 -0.239537 -0.320069 -0.387116 -0.209220 -0.182143 -0.122006 0.214280 0.235451 0.235410 0.221560 0.234072 0.259823 0.228003 0.228377 0.261248 0.255979 0.230665 0.251517 0.254900
chargesum: 0.00000
title: Mulliken charges with hydrogens summed into heavy atoms:
elementType: Cl O C C C C C C C C C C C C C C
charge: -0.070864 -0.292888 0.034758 0.457063 -0.017684 -0.201822 -0.101445 0.390237 0.007834 0.000590 -0.008872 -0.058822 -0.131136 0.042297 0.072758 -0.122006
polarizability: 1.95440562e+02 -2.27651878e+00 1.49820798e+02 -1.07362141e+01 1.19110244e+01 1.28425253e+02
1716.lowfreq: -6.5805 -0.0020 -0.0015 -0.0014 3.8689 6.1316 29.5695 30.8915 50.9725
frequency: 29.4197 30.8561 50.8697 87.5255 124.6616 144.7247 200.5615 227.5178 235.6798 257.0898 308.1959 327.5422 333.7313 401.7088 415.6253 437.7620 485.8720 498.3346 552.9870 592.5293 614.4683 627.1085 640.8519 694.5458 706.3647 755.2258 769.4422 781.2163 802.7209 822.3780 857.3754 906.0464 924.1038 929.6138 951.1411 980.5135 988.6513 990.6822 997.9300 999.5394 1025.0253 1063.7645 1071.9107 1078.6656 1107.4071 1121.4266 1173.0006 1173.9129 1184.3451 1210.9126 1214.7911 1289.5981 1294.4283 1311.1540 1339.3092 1370.0804 1385.6713 1389.6142 1403.3159 1440.8973 1460.5716 1470.1909 1471.8541 1483.1768 1584.5249 1594.7943 1601.7805 1613.8142 2961.8124 2996.2124 3100.1374 3103.2050 3108.8807 3127.7160 3138.9918 3150.6102 3157.0660 3160.0368 3165.3728 3176.6483 3181.4158
redmass: 5.6534 4.2209 3.8859 5.4747 4.9807 4.2111 2.9099 5.4611 1.4205 2.6931 5.3708 5.6874 5.4211 2.8317 3.0016 5.3421 4.4802 2.7580 3.3443 4.9293 6.4503 6.4160 5.8001 3.5198 1.7434 3.5686 1.8249 4.4294 1.2978 1.5313 1.2497 3.5752 1.3912 1.3441 1.3417 1.3927 4.9323 4.0072 2.1785 1.3585 2.1744 1.7504 2.4524 1.7789 1.3808 2.1012 1.0905 1.1537 1.1191 2.4898 2.9774 1.2676 1.6061 1.2683 1.3286 5.9166 4.3270 1.3429 3.8024 2.1366 1.0658 1.3084 1.7404 2.0739 7.3978 6.2067 6.6773 6.0657 1.0848 1.0350 1.0998 1.1011 1.0883 1.0859 1.0911 1.0957 1.0883 1.0888 1.1014 1.0970 1.0967
irintensity: 0.0274 0.1475 0.0040 0.4340 0.5108 1.5238 2.1753 0.1709 0.5081 0.3328 0.7738 3.6842 3.8020 0.3533 0.0103 5.2076 2.8276 21.6815 9.7767 5.9657 0.2085 0.1919 55.5302 0.5855 60.6971 1.2618 43.8239 0.6407 15.3903 74.2266 0.3822 42.9638 6.8900 0.5391 0.2750 0.4480 12.3107 34.7952 25.4947 1.1656 15.3971 73.7419 22.4528 18.2872 12.6082 2.0742 16.6658 41.4431 6.9203 73.1996 167.7740 1.6749 18.1054 1.9133 10.7429 7.8377 1.6933 25.5033 0.2084 20.3122 12.2661 61.6298 156.0229 10.5013 14.3585 1.8899 18.2424 1.6003 26.1825 18.5792 20.4108 26.9959 12.9835 0.0695 14.7582 27.9545 3.4245 3.7679 21.3578 6.8095 1.9601
temp: 298.150 k
press: 1.00000 atm
elementType: 17 8 6 6 6 6 6 6 6 6 6 6 6 6 6 6 1 1 1 1 1 1 1 1 1 1 1 1 1
symmnumber: 1
zpe: 597780.9 jmol-1
zpe.correction: 0.227683 hartree
zpe.thermalcorrener: 0.242021 hartree
zpe.thermalcorrenthalpy: 0.242965 hartree
zpe.thermalcorrgfe: 0.184543 hartree
zpe.sumelectzpe: -1075.427384 hartree
zpe.sumelectthermal: -1075.413045 hartree
zpe.sumelectthermalent: -1075.412101 hartree
zpe.sumelectthermalfe: -1075.470523 hartree
dipole: 3.3592 0.3293 -0.7051
dipole: 3.4482
quadrupole: -107.3986 -97.2676 -93.5830
quadrupole: -6.4692 -4.2550 1.7753
quadrupole: -7.9822 2.1488 5.8334 -6.4692 -4.2550 1.7753
hfenergy: -1075.6550663 hartree
pointgroup: C01 [X(C14H13Cl1O1)]
dipole: -1.2483811 0.3074329 0.432967 debye
polarizability: 192.7036934|-3.5887133|153.7892345|-18.0007413|-3.3975252|127.1936853 unknown
InChI: InChI=1S/C14H13ClO/c1-11(12-5-3-2-4-6-12)16-14-9-7-13(15)8-10-14/h2-11H,1H3
charge 0 multiplicity 1
29 atoms
Cl 4.844905 -2.168482 -0.663726
O  0.280605 1.693003 0.158576
C  -0.880059 1.400046 1.039206
C  -1.841682 0.3920 0.411074
C  -1.541473 2.76771 1.270253
C  -2.553911 -0.513371 1.235309
C  -2.076121 0.387223 -0.98579
C  1.288629 0.725415 0.012624
C  -3.493468 -1.408254 0.674919
C  -3.00922 -0.511237 -1.548048
C  -3.723104 -1.409602 -0.720284
C  1.251571 -0.5785 0.567303
C  2.409953 1.142258 -0.748656
C  2.339846 -1.458125 0.360104
C  3.492823 0.265922 -0.957349
C  3.443203 -1.026859 -0.396016
H  -0.49844 1.003531 2.004226
H  -0.824684 3.468356 1.731457
H  -1.884003 3.192001 0.310861
H  -2.416834 2.659058 1.933982
H  -2.375412 -0.520246 2.318834
H  -1.512198 1.075298 -1.625221
H  -4.038308 -2.104799 1.322008
H  -3.178099 -0.514135 -2.630749
H  0.385497 -0.933064 1.130926
H  2.418719 2.153981 -1.164704
H  -4.446113 -2.106565 -1.15844
H  2.316743 -2.467882 0.779956
H  4.359938 0.585116 -1.542537
