program: Gaussian 09
title: 000262981
version: EM64L-G09RevD.01
frameworkgroup: C1[X(C9H6N4)]
method: RPBEPBE
basis: SDD
operation: Freq
keyword: #p
keyword: freq=noraman
keyword: PBEPBE/SDD
title: #p freq=noraman PBEPBE/SDD
converged: YES YES NO NO
title: Mulliken charges:
elementType: N N N N C C C C C C C C C H H H H H H
charge: 0.041908 0.043279 0.041649 0.042044 -0.204201 0.222414 0.230190 -0.377696 -0.199495 -0.221877 -0.217258 -0.199522 -0.675851 0.312496 0.234493 0.235797 0.234264 0.219501 0.237865
chargesum: 0.00000
title: Mulliken charges with hydrogens summed into heavy atoms:
elementType: N N N N C C C C C C C C C
charge: 0.041908 0.043279 0.041649 0.042044 0.108295 0.222414 0.230190 0.092595 -0.199495 -0.221877 -0.217258 -0.199522 0.015779
polarizability: 1.18991584e+02 7.10234291e+00 1.13949809e+02 1.33023119e+01 4.06477463e+00 9.33126693e+01
1716.lowfreq: -15.1158 -6.7790 -0.0009 -0.0006 -0.0002 7.4318 61.7541 78.0802 84.6813
frequency: 61.3230 78.0795 84.6647 107.1218 108.6878 130.8394 133.4324 153.8350 222.8206 225.0571 252.3614 344.8065 366.4395 418.3463 428.0579 451.6583 483.9103 506.1118 573.0680 574.2583 608.8889 641.9138 725.0448 731.9051 807.2002 925.9007 978.7766 1019.5780 1038.2226 1091.6519 1102.3462 1179.5099 1243.1420 1251.4456 1263.5051 1311.7193 1365.4345 1401.9756 1465.5347 1479.4112 1482.4505 2196.7762 2203.1393 2205.2852 2208.3970 2990.9122 3000.7513 3052.4590 3088.4085 3097.2765 3126.5718
redmass: 2.8751 13.5398 8.0354 7.1929 7.4450 9.6990 6.2605 2.3034 1.6676 8.9424 3.2652 5.1814 4.0439 10.7792 12.0083 10.9025 12.3019 6.3052 12.3995 11.9481 3.8861 7.1767 5.2171 4.4915 1.4412 2.0182 3.5493 1.8862 2.3086 3.1991 1.9409 2.9334 2.8322 3.9556 1.3405 1.3988 1.7140 1.2141 1.0657 1.0508 1.0562 12.6443 12.6243 12.6373 12.6257 1.0365 1.0605 1.1011 1.1013 1.0995 1.0905
irintensity: 0.1763 0.0090 0.7697 1.3365 1.6346 10.5773 7.1788 2.1859 0.3358 0.8902 0.6149 0.3864 0.4441 0.1735 0.1101 0.3993 0.0092 1.4029 2.3857 0.5455 5.5653 6.1985 9.5985 26.7916 9.3247 7.0352 4.6078 9.5355 2.2182 0.2656 2.3875 7.3762 0.9615 0.4692 3.7654 2.6995 0.2736 11.7213 7.8158 13.3288 13.2511 1.5568 0.1095 10.2513 0.7535 17.7617 11.1023 1.6754 31.6090 22.9579 0.8625
temp: 298.150 k
press: 1.00000 atm
elementType: 7 7 7 7 6 6 6 6 6 6 6 6 6 1 1 1 1 1 1
symmnumber: 1
zpe: 334897.0 jmol-1
zpe.correction: 0.127556 hartree
zpe.thermalcorrener: 0.140934 hartree
zpe.thermalcorrenthalpy: 0.141878 hartree
zpe.thermalcorrgfe: 0.087392 hartree
zpe.sumelectzpe: -564.537899 hartree
zpe.sumelectthermal: -564.524521 hartree
zpe.sumelectthermalent: -564.523577 hartree
zpe.sumelectthermalfe: -564.578063 hartree
dipole: 3.4852 0.0762 -3.9620
dipole: 5.2773
quadrupole: -85.6733 -90.1204 -78.6410
quadrupole: -3.2748 -10.2116 -2.3289
quadrupole: -0.8617 -5.3089 6.1706 -3.2748 -10.2116 -2.3289
hfenergy: -564.6654546 hartree
pointgroup: C01 [X(C9H6N4)]
dipole: 1.1329272 0.4395725 -1.6834597 debye
dipolederiv: -0.1385586 0.0481654 0.0287695 -0.0011657 -0.1404397 0.0060931 -0.0109646 0.014928 -0.1555073 -0.1397421 -0.0061836 0.0246778 0.0380052 -0.1462481 0.0329152 0.0462009 0.0073761 -0.1323388 -0.1383593 0.0300014 0.0423749 -0.0079932 -0.145959 0.0041108 0.0314517 0.0378852 -0.1344526 -0.1223097 -0.0044519 0.0201338 0.0334924 -0.1483378 0.0213912 0.0045624 -0.0103402 -0.1562484 0.1931725 -0.2109661 -0.1336969 -0.1718474 0.4109203 -0.1342319 -0.1631466 -0.1335147 0.1545366 -0.0040527 0.184156 0.0456385 0.0066467 0.206771 -0.0273999 0.2354855 -0.3002075 0.2432097 0.2526225 -0.1253835 -0.0114971 0.0355456 0.0313978 0.0560792 -0.1676175 0.3480345 0.1973507 0.0500982 0.0473529 -0.023738 0.0531424 -0.0221733 -0.0550085 0.0585136 0.0035827 0.0538862 0.1504106 -0.0855943 -0.0045875 0.0573514 -0.1433574 -0.0289837 0.0522733 -0.0605727 -0.0979897 -0.1441555 0.0921393 0.0039529 -0.0293937 0.0266191 0.0355118 -0.0533298 0.1296076 0.0144488 0.0066042 -0.0992065 0.0367182 0.0115961 -0.1432702 0.011715 0.0824694 -0.0921721 0.0333777 -0.075691 0.1799455 -0.0441458 0.0495989 0.0842336 -0.0053991 -0.0264752 0.048012 -0.1039867 -0.0212204 0.0228896 0.0613073 -0.0507645 0.0302873 0.0391437 0.015148 -0.0182404 0.087024 0.0344067 -0.0128248 -0.0074337 -0.0276433 0.0397466 -0.0083051 -0.0476375 -0.0270163 0.0276489 0.0424344 -0.0134907 -0.0087077 -0.0007286 0.0783783 -0.0466033 -0.022295 -0.0736676 -0.0780411 0.0158238 0.0271928 0.0149807 0.0302662 -0.0593238 0.0911732 -0.0105838 0.0862837 0.0444297 0.0924539 0.0279949 -0.0120057 0.0565613 -0.0563427 0.0727809 -0.0330551 0.1073153 0.0090938 0.0465904 -0.0238951 -0.1131497 0.0048734 0.0632651 -0.0767411 -0.0461132 -0.0727482 -0.0842188 -0.1005279 -0.0778415 0.0804083 -0.087543 0.0338329 0.0117587 0.0551135 0.0054544 0.0777774 unknown
polarizability: 122.0050991|5.4828249|111.5633292|10.5795704|8.1369506|92.6856349 unknown
InChI: InChI=1S/C9H6N4/c1-2-7-8(3-10,4-11)9(7,5-12)6-13/h7H,2H2,1H3
charge 0 multiplicity 1
19 atoms
N  -3.243701 0.521915 -0.534674
N  0.063458 2.601832 1.643829
N  2.074442 -0.874126 1.9105
N  -1.237411 -2.956771 -0.259403
C  0.33902 0.218382 -1.114735
C  -0.656473 0.665899 -0.008219
C  0.151488 -0.735792 0.100127
C  1.654999 0.944942 -1.346919
C  -2.078679 0.586878 -0.286339
C  -0.26182 1.725054 0.903111
C  1.201168 -0.811211 1.100066
C  -0.614566 -1.954082 -0.086213
C  2.679185 0.045318 -2.075428
H  -0.162099 -0.144719 -2.020475
H  2.077283 1.29802 -0.387887
H  1.442276 1.847996 -1.950711
H  2.941215 -0.839311 -1.467966
H  2.290886 -0.307105 -3.048248
H  3.609328 0.607082 -2.266713
