program: Gaussian 09
title: 000262988
version: EM64L-G09RevD.01
frameworkgroup: C1[X(C10H12BrNO2)]
method: RPBEPBE
basis: SDD
operation: Freq
keyword: #p
keyword: freq=noraman
keyword: PBEPBE/SDD
title: #p freq=noraman PBEPBE/SDD
converged: YES YES NO NO
title: Mulliken charges:
elementType: Br O O N C C C C C C C C C C H H H H H H H H H H H H
charge: 0.014652 -0.185889 -0.185741 -0.025760 0.158256 0.158113 0.475971 0.476087 0.062338 -0.623101 -0.822115 -0.822245 -0.855582 -0.855805 0.249424 0.233875 0.255878 0.249301 0.255968 0.233848 0.254174 0.260747 0.261248 0.254207 0.261418 0.260734
chargesum: 0.00000
title: Mulliken charges with hydrogens summed into heavy atoms:
elementType: Br O O N C C C C C C C C C C
charge: 0.014652 -0.185889 -0.185741 -0.025760 0.158256 0.158113 0.475971 0.476087 0.062338 -0.623101 -0.082939 -0.083129 -0.079412 -0.079447
polarizability: 1.98431713e+02 7.72684741e-03 1.55211156e+02 2.70561349e-02 4.49311317e+00 8.19018944e+01
1716.lowfreq: -4.3175 -0.0004 -0.0004 -0.0001 9.4773 9.8287 50.6985 53.1533 85.6246
frequency: 50.6822 53.1521 85.6233 106.0265 122.5586 127.0610 152.5399 167.4203 175.3114 192.4096 225.7189 232.6098 281.1717 297.2569 346.3229 381.6216 387.9124 429.1906 436.3478 451.0179 507.8592 545.5973 583.8389 630.5248 675.2946 689.2278 736.9896 753.6811 856.1422 893.2472 1003.3321 1021.7907 1025.2288 1031.8132 1037.3766 1047.4685 1050.1682 1052.6369 1096.0154 1187.6071 1239.6830 1294.5909 1340.6153 1360.0584 1373.1152 1403.2726 1404.1947 1407.5572 1412.6885 1436.0021 1448.3587 1462.5226 1463.4660 1473.6590 1479.9428 1484.7361 1496.9287 1501.6578 1547.3126 1590.9416 2990.4541 2990.9894 2995.3346 2995.5453 3062.5855 3062.8168 3071.4220 3071.8247 3123.1549 3123.5323 3127.9747 3128.3740
redmass: 3.7641 5.6417 1.6134 2.2959 1.3193 1.5700 1.7629 1.1504 6.2120 2.1156 15.3047 3.5950 5.5657 3.5534 3.4477 2.4580 2.5127 4.6675 4.9373 6.5113 4.7358 4.1799 3.4327 4.7645 4.8841 5.9471 7.9769 5.0310 3.4016 5.3844 1.4999 1.3967 1.4380 1.6144 1.7308 2.5518 1.6633 1.5786 2.1486 5.4795 12.4437 9.2793 5.9938 8.9797 4.7363 1.2403 1.2387 1.3164 1.1720 2.9031 1.2357 1.0530 1.0626 1.2757 1.0696 1.0622 1.0811 1.0838 3.9866 7.9076 1.0406 1.0405 1.0407 1.0407 1.0964 1.0963 1.0975 1.0974 1.0962 1.0960 1.0954 1.0954
irintensity: 0.6376 2.3837 0.2663 1.6317 0.0752 0.6316 5.5216 0.2849 3.1586 0.3806 1.7607 2.1226 2.4457 4.8252 1.5915 0.6279 1.3831 4.8165 0.0684 0.0774 0.4176 0.6369 1.9115 0.0044 22.6157 1.6482 1.8760 0.2632 0.8111 55.4854 62.1987 1.6207 9.2814 1.1373 15.7378 0.2542 1.1783 1.6162 9.6975 60.7696 112.1278 42.0873 7.9685 134.6076 0.0184 13.2237 15.1714 35.7373 2.2364 2.6708 7.9284 0.1876 60.7548 37.2825 1.7058 21.1306 9.0575 15.0806 33.6552 1.2709 18.2706 9.0659 27.3875 2.4355 20.0381 0.5211 9.7113 11.7041 15.8848 17.2260 9.6244 4.1759
temp: 298.150 k
press: 1.00000 atm
elementType: 35 8 8 7 6 6 6 6 6 6 6 6 6 6 1 1 1 1 1 1 1 1 1 1 1 1
symmnumber: 1
zpe: 523325.0 jmol-1
zpe.correction: 0.199324 hartree
zpe.thermalcorrener: 0.214557 hartree
zpe.thermalcorrenthalpy: 0.215501 hartree
zpe.thermalcorrgfe: 0.156253 hartree
zpe.sumelectzpe: -605.802898 hartree
zpe.sumelectthermal: -605.787665 hartree
zpe.sumelectthermalent: -605.786721 hartree
zpe.sumelectthermalfe: -605.845968 hartree
dipole: 2.9959 0.0006 -0.0030
dipole: 2.9959
quadrupole: -112.0517 -77.9039 -95.9011
quadrupole: -0.0036 0.0076 -2.5445
quadrupole: -16.7662 17.3817 -0.6155 -0.0036 0.0076 -2.5445
hfenergy: -606.0022215 hartree
pointgroup: C01 [X(C10H12Br1N1O2)]
dipole: 1.1786821 -0.0000815 0.001809 debye
dipolederiv: -0.7745864 -0.0002295 0.0002546 -0.0002153 -0.0479235 0.0054793 0.0004796 -0.0014776 -0.0315246 -0.6918301 0.1250293 0.192808 0.1428323 -0.3305559 -0.195217 0.0908834 -0.2185978 -0.5709564 -0.6909706 -0.1246732 -0.1930887 -0.1425752 -0.3306569 -0.1956883 -0.0916691 -0.2191907 -0.5719134 1.4413406 -0.0004012 0.0005008 -0.0001501 0.2901806 0.4496238 0.0010838 0.483086 0.9660145 0.1662373 -0.2985097 -0.006949 0.1058107 0.1574642 -0.0080289 0.1575178 -0.0012196 -0.0263963 0.1664359 0.2984121 0.0071743 -0.105668 0.1575894 -0.0082485 -0.1573706 -0.0016095 -0.0267168 -0.3756524 0.4197985 0.0098924 0.1916782 0.0689702 0.0076448 0.0064787 -0.0042037 0.0150597 -0.3752622 -0.4202899 -0.0095663 -0.1917523 0.0685647 0.0073219 -0.0063553 -0.0039428 0.0152188 -0.3378856 -0.0000457 -0.0002377 -0.0004897 0.0606667 -0.0463546 -0.0002119 -0.0032745 -0.0498307 1.3116145 0.0004538 -0.0012724 0.000168 0.0297915 -0.0010093 -0.0014828 -0.0016269 -0.1835445 -0.0215826 0.0617597 -0.0004268 0.0723802 -0.1440363 -0.0133113 -0.0214236 -0.0276186 0.0809226 -0.0217068 -0.0612005 0.0002582 -0.0721169 -0.1443739 -0.0132568 0.0215713 -0.0265155 0.0810668 -0.0694117 -0.1385046 -0.0090004 -0.1058001 -0.0640933 -0.006359 -0.0297268 0.0193083 0.046054 -0.069768 0.1391873 0.0088405 0.1062063 -0.0632818 -0.0060765 0.0298126 0.0176147 0.0459854 0.0917787 0.0196852 -0.0391322 0.0224411 0.0055633 -0.05729 -0.0205828 -0.0948336 -0.0407641 0.0586525 -0.0399415 0.0741928 -0.0021651 -0.0221977 0.0689758 0.0478811 0.1061219 -0.0003096 -0.0771426 0.0276792 -0.0415517 -0.0543728 0.1087108 -0.0092846 -0.0313249 -0.0163166 0.0871564 0.0913646 -0.0189973 0.0401284 -0.02189 0.0052629 -0.0576738 0.0212985 -0.0951804 -0.0402105 -0.0773061 -0.0277846 0.0405895 0.0544505 0.1090029 -0.0087946 0.0302397 -0.0165515 0.0876693 0.0592134 0.0390232 -0.0739447 0.0014667 -0.0220812 0.0691891 -0.0477226 0.1062982 -0.0014286 0.0412981 0.1524763 0.0252415 0.0647564 -0.0555301 -0.0160748 0.0158651 -0.0216537 0.0979431 0.0434554 -0.0583461 0.0768741 -0.0297269 0.0458712 -0.0036505 0.0921645 0.0339661 -0.0346789 0.0134759 -0.0363254 -0.091145 -0.0083852 0.0635539 0.0292161 -0.0933371 -0.0127344 -0.0039963 0.0415271 -0.1529438 -0.02327 -0.0650609 -0.0560343 -0.0146548 -0.014932 -0.0196102 0.0983456 0.0145547 0.0369289 0.0906656 0.0094629 0.0629374 0.0284142 0.0934337 -0.0131991 -0.0058403 0.0421564 0.0577594 -0.0778359 0.0287152 0.0466353 -0.0048918 -0.0925703 0.0329613 -0.0333254 unknown
polarizability: 198.4317116|-0.0020045|154.5150534|0.0336345|8.4103563|82.5979983 unknown
InChI: InChI=1S/C10H12BrNO2/c1-5-7(3)10(12(13)14)8(4)6(2)9(5)11/h1-4H3
charge 0 multiplicity 1
26 atoms
Br 3.78935 0.0010 -0.000357
O  -3.021275 0.56241 0.986638
O  -3.01849 -0.563092 -0.995324
N  -2.411722 -0.000452 -0.003614
C  -0.270369 1.258603 0.031488
C  -0.269787 -1.258922 -0.032581
C  1.156617 1.256713 0.042516
C  1.157164 -1.256598 -0.040694
C  -0.926352 -0.000268 -0.001387
C  1.813433 0.000245 0.001067
C  -1.034692 2.573057 0.011829
C  -1.033902 -2.573473 -0.014138
C  1.943553 2.552228 0.093605
C  1.944935 -2.55161 -0.089962
H  -0.928852 3.105221 0.975122
H  -0.648221 3.23511 -0.782458
H  -2.11172 2.436047 -0.157368
H  -0.922041 -3.108355 -0.975224
H  -2.111917 -2.436466 0.148405
H  -0.65205 -3.233421 0.78424
H  1.293313 3.42855 0.223924
H  2.533622 2.695729 -0.831043
H  2.667403 2.537411 0.928105
H  1.294789 -3.429543 -0.209487
H  2.661891 -2.541481 -0.930589
H  2.54272 -2.688544 0.830584
