program: Gaussian 09
title: 000262959
version: EM64L-G09RevD.01
frameworkgroup: C1[X(C13H10BrCl)]
method: RPBEPBE
basis: SDD
operation: Freq
keyword: #p
keyword: freq=noraman
keyword: PBEPBE/SDD
title: #p freq=noraman PBEPBE/SDD
converged: NO YES NO NO
title: Mulliken charges:
elementType: Br Cl C C C C C C C C C C C C C H H H H H H H H H H
charge: 0.006200 -0.058616 -0.741904 0.510359 0.511523 -0.373675 -0.372952 -0.369043 -0.370452 -0.184188 -0.184360 -0.212140 -0.211839 -0.213438 -0.106859 0.222463 0.222802 0.230458 0.230311 0.228697 0.228854 0.249739 0.249759 0.254142 0.254159
chargesum: 0.00000
title: Mulliken charges with hydrogens summed into heavy atoms:
elementType: Br Cl C C C C C C C C C C C C C
charge: 0.006200 -0.058616 -0.296638 0.510359 0.511523 -0.143217 -0.142641 -0.140346 -0.141598 0.065551 0.065398 0.042002 0.042320 -0.213438 -0.106859
polarizability: 2.23955414e+02 2.52812785e-01 1.13569932e+02 1.26835269e-01 -4.33739969e-01 1.43313147e+02
1716.lowfreq: -30.1410 -8.5241 -1.5933 0.0009 0.0021 0.0022 6.8387 23.7698 31.3327
frequency: -30.1212 23.7655 31.3033 81.1245 127.6553 166.9071 234.9200 254.5017 272.2054 317.0548 329.7563 378.0335 392.7328 402.9789 407.5503 485.1747 501.7563 610.9653 623.5326 629.3432 629.9538 702.0989 727.4990 775.4150 805.9449 819.9832 826.1778 832.3799 867.0035 922.3475 945.6641 956.8603 963.0560 969.2300 995.0774 999.6884 1061.2197 1073.7507 1092.8261 1115.8976 1158.9085 1183.9510 1187.2640 1194.4689 1211.4586 1295.9513 1296.5663 1298.0521 1369.4648 1377.7395 1391.8698 1397.4022 1468.5837 1472.7327 1481.3368 1582.4793 1587.9747 1593.9396 1601.6119 3000.5618 3058.1772 3125.1067 3127.9532 3128.6872 3130.6492 3166.2418 3167.4797 3169.3858 3170.6202
redmass: 3.6698 16.7375 4.1515 8.8643 8.9029 8.1449 4.7163 9.7268 6.9385 4.2375 8.2824 1.9764 7.0455 2.8429 2.8885 2.9250 3.8037 4.8224 7.1527 6.4831 4.6452 3.7174 4.0939 2.6231 3.4360 1.6323 1.2506 1.2463 2.0910 1.7634 1.3312 1.4020 1.3786 1.3698 5.0807 4.3121 2.6206 2.8011 1.4388 1.3203 1.0865 1.1504 1.2397 2.3716 2.6556 1.4473 1.2680 1.2810 7.8973 6.7763 2.8832 2.5216 1.6532 1.9533 1.5851 7.3569 7.1507 6.2656 6.3620 1.0595 1.1030 1.0898 1.0897 1.0897 1.0897 1.0951 1.0948 1.0962 1.0959
irintensity: 0.0047 0.1228 0.1668 0.0162 0.0726 0.0567 0.0760 1.4655 0.1525 0.1411 8.3648 0.0619 2.1505 0.0016 0.0175 22.8540 41.8215 12.9595 0.0439 0.5581 9.7641 0.1167 0.0961 71.3522 44.5985 22.0271 0.0053 0.2772 29.4152 0.0984 0.0098 0.1319 0.0373 0.4491 69.3958 30.5770 29.9065 40.4219 0.0849 20.5305 0.0084 0.3397 1.3920 0.4306 4.8865 2.8539 0.5783 0.0763 0.3646 0.1864 10.6331 1.0406 61.8296 117.6376 11.7517 0.1741 0.5252 5.2803 8.0351 32.9496 9.1339 0.6142 21.5672 20.2868 8.3277 6.2934 10.9734 0.4145 0.2303
temp: 298.150 k
press: 1.00000 atm
elementType: 35 17 6 6 6 6 6 6 6 6 6 6 6 6 6 1 1 1 1 1 1 1 1 1 1
symmnumber: 1
zpe: 488973.3 jmol-1
zpe.correction: 0.186240 hartree
zpe.thermalcorrener: 0.198678 hartree
zpe.thermalcorrenthalpy: 0.199622 hartree
zpe.thermalcorrgfe: 0.144333 hartree
zpe.sumelectzpe: -973.859085 hartree
zpe.sumelectthermal: -973.846648 hartree
zpe.sumelectthermalent: -973.845703 hartree
zpe.sumelectthermalfe: -973.900992 hartree
dipole: -0.1993 2.4482 0.0135
dipole: 2.4563
quadrupole: -124.3346 -105.9965 -89.7912
quadrupole: -3.8835 0.0117 -0.1549
quadrupole: -17.6272 0.7110 16.9162 -3.8835 0.0117 -0.1549
hfenergy: -974.0453252 hartree
pointgroup: C01 [X(C13H10Br1Cl1)]
dipole: -0.0077023 -0.9660279 -0.0252479 debye
dipolederiv: -0.5937573 -0.3035733 -0.0076886 -0.3704789 -0.2482855 -0.0043499 -0.0093463 -0.0043486 -0.0721184 -0.6873661 0.337039 0.0092415 0.422885 -0.3062386 -0.0045083 0.0116487 -0.0045513 -0.1282636 -0.1364211 0.0004995 0.0002204 0.0076238 0.198852 0.0012563 0.0008596 0.0006899 0.1504743 0.3435874 0.1358396 0.003473 0.2812736 -0.0554179 -0.0000017 0.0070117 0.0002343 -0.0545931 0.3301267 -0.1380635 -0.0037371 -0.2967094 -0.0630049 0.0007568 -0.0076326 0.0007495 -0.0741036 -0.1361343 0.0700872 -0.0462503 0.0243282 -0.1012299 -0.0164099 0.0000433 -0.0138121 0.0542142 -0.1355658 0.0674868 0.0503101 0.0244525 -0.1025353 0.0075238 0.0028922 0.0052586 0.0551714 -0.1336523 -0.0701892 -0.0403844 -0.0273377 -0.0999483 -0.0005534 -0.0237593 0.0183578 0.0703175 -0.1343161 -0.0726626 0.0351191 -0.0286628 -0.0979526 -0.0107549 0.0195373 -0.029755 0.0693982 -0.3025982 -0.1256522 0.0807117 -0.1487053 -0.1670509 0.0530034 0.0330936 0.0117027 0.0394585 -0.3030327 -0.1211719 -0.0865116 -0.1465509 -0.1629939 -0.0636368 -0.0407461 -0.022521 0.0355699 -0.2529661 0.0829735 0.0506627 0.1063777 -0.1495512 -0.0411219 0.0706257 -0.0407127 0.0143572 -0.2521545 0.0857972 -0.0470764 0.1109272 -0.1539275 0.0309747 -0.0652723 0.0308717 0.0180264 0.9258951 0.6396082 0.0163667 0.7133227 0.3065404 0.0069269 0.018368 0.0071262 0.0156506 0.8884499 -0.5819757 -0.016241 -0.6640898 0.3342292 0.0056246 -0.0183566 0.0057051 0.0963779 0.0091561 -0.0009198 0.0000205 -0.0012543 -0.0060237 0.0426545 0.0019803 0.1534297 -0.04917 0.0086531 -0.0003432 0.0002289 -0.0005926 0.0038207 -0.0398843 -0.0021288 -0.1504599 -0.0590609 0.0579103 -0.0822605 0.0913031 -0.0722193 0.0872743 0.0508188 0.087425 0.045519 -0.0331893 0.057216 -0.0773806 -0.0960184 -0.0677212 0.09201 -0.0436088 -0.0925323 -0.0387088 -0.0378267 0.0692395 0.0713618 0.0963777 0.06014 0.0937554 -0.0443038 0.0941666 -0.0380741 -0.0387007 0.0699118 0.0769379 -0.0911272 0.0653808 0.0880675 0.0529841 -0.0889057 0.0467213 -0.0339794 0.0765139 -0.0438177 -0.0599372 -0.0576728 0.1288186 -0.0340742 -0.0668507 -0.0314874 -0.0143026 0.0769238 -0.0468992 0.0571362 -0.0611523 0.1248033 0.0418521 0.0633485 0.0392581 -0.010628 0.0776007 0.0502855 -0.0543347 0.0649531 0.1257413 0.0419414 -0.0580587 0.0377355 -0.0046854 0.0767803 0.0469931 0.0581353 0.0614828 0.1302477 -0.0331094 0.062589 -0.0289284 -0.0083944 unknown
polarizability: 223.4006599|7.8100793|114.1553392|0.0610911|-1.0439666|143.2824937 unknown
InChI: InChI=1S/C13H10BrCl/c14-12-5-1-10(2-6-12)9-11-3-7-13(15)8-4-11/h1-8H,9H2
charge 0 multiplicity 1
25 atoms
Br 5.226607 1.752211 0.043232
Cl -5.105786 1.725971 0.046697
C  -0.019284 -1.784859 -0.047054
C  1.261961 -0.948094 -0.025491
C  -1.290837 -0.933418 -0.024644
C  1.866295 -0.574139 1.200894
C  1.86291 -0.506821 -1.231005
C  -1.884383 -0.480422 -1.230122
C  -1.892621 -0.557332 1.202947
C  3.033647 0.221859 1.233732
C  3.030249 0.289737 -1.223137
C  -3.042017 0.329112 -1.220485
C  -3.05039 0.251373 1.236474
C  3.60062 0.646531 0.015308
C  -3.607803 0.685113 0.018589
H  -0.022951 -2.464532 0.82488
H  -0.023027 -2.418262 -0.953198
H  1.427679 -0.908621 2.148798
H  1.421983 -0.788799 -2.194759
H  -1.444688 -0.763339 -2.194065
H  -1.459154 -0.900444 2.150035
H  3.491041 0.500819 2.187267
H  3.485144 0.620683 -2.161103
H  -3.494991 0.672271 -2.155343
H  -3.509901 0.534899 2.187953
