program: Gaussian 09
title: 000263099
version: EM64L-G09RevD.01
frameworkgroup: C1[X(C16H14N2O)]
method: RPBEPBE
basis: SDD
operation: Freq
keyword: #p
keyword: freq=noraman
keyword: PBEPBE/SDD
title: #p freq=noraman PBEPBE/SDD
converged: YES YES NO NO
title: Mulliken charges:
elementType: O N N C C C C C C C C C C C C C C C C H H H H H H H H H H H H H H
charge: -0.264556 -0.203530 -0.034950 0.015403 0.210032 0.147543 0.074232 0.139696 0.291668 -0.348053 -0.614597 -0.324311 -0.359183 -0.411245 -0.816362 -0.253617 -0.244502 -0.206789 -0.224288 0.247175 0.271893 0.244790 0.250816 0.271223 0.260527 0.234345 0.225108 0.270124 0.220120 0.233852 0.233598 0.230794 0.233047
chargesum: 0.00000
title: Mulliken charges with hydrogens summed into heavy atoms:
elementType: O N N C C C C C C C C C C C C C C C C
charge: -0.264556 -0.203530 -0.034950 0.015403 0.210032 0.147543 0.074232 0.139696 0.291668 -0.100879 0.152901 -0.053088 -0.098657 -0.176901 -0.101010 -0.019765 -0.010905 0.026258 0.006507
polarizability: 2.90019123e+02 1.15643923e+01 1.84621452e+02 -3.90639330e+00 -5.61466915e+00 1.13229471e+02
1716.lowfreq: -2.6109 0.0005 0.0007 0.0008 3.7425 8.0805 29.4791 47.8089 70.9361
frequency: 29.3578 47.7643 70.9352 99.6272 107.8327 127.5812 140.2960 179.6290 195.0613 230.5401 267.6729 275.8618 308.7826 323.2528 374.7986 399.3877 427.6505 444.5175 450.7450 503.9686 508.7736 530.5006 547.9069 579.5690 630.3678 658.0022 679.7664 685.3870 705.4199 738.6943 771.4350 780.4735 784.4891 795.4321 830.6409 865.6968 879.4854 896.6112 954.0973 963.2374 980.1626 989.2479 992.3661 1003.2805 1016.8961 1027.7430 1046.8545 1048.5135 1098.8785 1117.6555 1122.0103 1157.3190 1175.0181 1176.0751 1190.8823 1213.0337 1231.2691 1256.4462 1278.7686 1290.2086 1324.2226 1367.9952 1391.6082 1398.7121 1425.5028 1429.1818 1452.7775 1453.1654 1456.8463 1462.0758 1476.9955 1485.8795 1494.4133 1540.3079 1562.1794 1582.8604 1607.7381 1611.2888 1620.2844 2983.8520 3010.4626 3066.4855 3090.9411 3101.1103 3121.9346 3126.9910 3134.3573 3142.0809 3143.2946 3149.3088 3163.8586 3164.1496 3173.3384
redmass: 4.2565 4.4908 4.2280 3.9872 1.1287 3.2086 1.1691 2.9929 4.5575 5.5544 4.3849 4.9936 4.1978 4.8085 3.3532 3.2615 6.0558 3.4178 3.0830 5.3846 4.8871 5.2947 4.1251 7.4410 5.1851 6.2529 5.5775 4.8060 6.4370 2.0042 2.0398 3.6098 1.5395 3.5181 5.1603 4.2519 1.3944 1.5027 1.5683 4.2320 1.3715 1.6029 1.3295 1.3310 2.4073 2.1979 1.5972 2.0828 2.0379 1.3574 1.6849 1.5419 1.7983 1.0699 2.3794 2.3948 2.5557 3.1871 1.6306 1.9899 3.2748 8.1084 7.4979 1.2329 1.7744 1.3550 1.2553 2.0185 2.5952 1.0661 1.2762 1.8318 1.1882 8.5455 6.9568 6.5936 8.4124 6.6431 7.2062 1.0372 1.0354 1.0963 1.1002 1.0985 1.0858 1.0895 1.0861 1.1028 1.0939 1.0900 1.1007 1.0954 1.1000
irintensity: 0.3255 0.0628 0.8710 7.6872 0.7519 0.2717 0.7986 0.4908 0.4984 0.0672 0.7799 0.4000 3.5213 3.6095 7.5450 0.1578 4.0130 0.7379 8.2509 1.6213 1.2899 1.6896 4.3704 2.4108 8.6624 5.6554 4.5520 15.1484 1.8530 26.6190 42.4103 19.0669 73.2793 2.8173 0.6522 3.8174 0.2215 0.5469 0.4267 1.9284 2.8246 1.3561 0.4541 0.0610 64.1987 20.0708 8.2147 10.1605 18.3032 6.2495 3.3391 9.7369 11.2193 2.2529 1.4677 5.7541 12.8567 9.5189 9.0652 6.7517 47.4641 1.6394 40.3915 16.9877 3.6895 49.6444 13.6923 9.5892 56.1136 15.9909 21.9606 33.1617 21.2985 273.8622 2.7645 1.6886 233.9013 76.3378 23.4312 21.1523 28.1924 15.1912 23.6373 10.0148 8.3751 2.2227 4.7612 4.5794 27.8519 8.1018 33.8737 9.3204 24.0933
temp: 298.150 k
press: 1.00000 atm
elementType: 8 7 7 6 6 6 6 6 6 6 6 6 6 6 6 6 6 6 6 1 1 1 1 1 1 1 1 1 1 1 1 1 1
symmnumber: 1
zpe: 681393.4 jmol-1
zpe.correction: 0.259529 hartree
zpe.thermalcorrener: 0.275514 hartree
zpe.thermalcorrenthalpy: 0.276459 hartree
zpe.thermalcorrgfe: 0.215576 hartree
zpe.sumelectzpe: -801.540878 hartree
zpe.sumelectthermal: -801.524893 hartree
zpe.sumelectthermalent: -801.523948 hartree
zpe.sumelectthermalfe: -801.584831 hartree
dipole: 2.0565 -1.3133 0.2092
dipole: 2.4490
quadrupole: -93.8325 -112.7659 -110.1650
quadrupole: 10.6671 2.0271 -4.5985
quadrupole: 11.7553 -7.1781 -4.5772 10.6671 2.0271 -4.5985
hfenergy: -801.8004069 hartree
pointgroup: C01 [X(C16H14N2O1)]
dipole: -0.8022556 -0.4400478 -0.3018416 debye
polarizability: 290.3245266|-8.1035389|167.3640462|-7.0256828|30.8366553|130.1814723 unknown
InChI: InChI=1S/C16H14N2O/c1-11-7-3-4-8-12(11)15-17-14-10-6-5-9-13(14)16(19)18(15)2/h3-10H,1-2H3
charge 0 multiplicity 1
33 atoms
O  1.964586 2.778139 0.705935
N  0.105815 1.394401 0.326413
N  0.331572 -0.953327 -0.178285
C  -0.423675 0.111589 0.062918
C  -1.911446 -0.071391 0.099803
C  2.353435 0.434069 0.185031
C  1.727783 -0.812908 -0.135568
C  1.520642 1.621429 0.435313
C  -2.619741 -0.552572 -1.042571
C  -2.602109 0.173762 1.314888
C  -0.750604 2.599142 0.458257
C  3.768392 0.531165 0.242317
C  2.541372 -1.950862 -0.399756
C  -4.017697 -0.758254 -0.921867
C  -1.91916 -0.844017 -2.357112
C  -3.99057 -0.050064 1.417731
C  4.558615 -0.599466 -0.020819
C  3.940023 -1.84205 -0.343446
C  -4.70265 -0.515011 0.289309
H  -2.04159 0.520439 2.191074
H  -0.180833 3.461337 0.078814
H  -0.998876 2.798004 1.515062
H  -1.678606 2.46022 -0.1137
H  4.211481 1.501246 0.490029
H  2.043739 -2.896063 -0.636705
H  -4.573727 -1.119786 -1.794913
H  -1.319142 0.01808 -2.703841
H  -1.217434 -1.688838 -2.242422
H  -2.649116 -1.092594 -3.146154
H  -4.507485 0.132609 2.365725
H  5.650641 -0.529045 0.021348
H  -5.782552 -0.689601 0.351812
H  4.562516 -2.720578 -0.546319
