program: Gaussian 09
title: 000262914
version: EM64L-G09RevD.01
frameworkgroup: C1[X(C14H11Br)]
method: RPBEPBE
basis: SDD
operation: Freq
keyword: #p
keyword: freq=noraman
keyword: PBEPBE/SDD
title: #p freq=noraman PBEPBE/SDD
converged: NO YES NO NO
title: Mulliken charges:
elementType: Br C C C C C C C C C C C C C C H H H H H H H H H H H
charge: 0.015875 0.236855 0.304268 0.288954 -0.368360 -0.361145 -0.368894 -0.360912 -0.221553 -0.223477 -0.221338 -0.223709 -0.236744 -0.237641 -0.603728 0.236111 0.229813 0.236420 0.229546 0.229033 0.227612 0.229017 0.227604 0.230843 0.229406 0.276145
chargesum: 0.00000
title: Mulliken charges with hydrogens summed into heavy atoms:
elementType: Br C C C C C C C C C C C C C C
charge: 0.015875 0.236855 0.304268 0.288954 -0.132249 -0.131332 -0.132474 -0.131366 0.007480 0.004134 0.007679 0.003895 -0.005902 -0.008235 -0.327583
polarizability: 1.96897198e+02 7.71658954e+00 1.38190334e+02 9.57503223e-02 -2.28583068e-01 1.41710506e+02
1716.lowfreq: -49.6346 -37.5830 -9.4860 -8.6815 0.0002 0.0005 0.0006 10.5258 49.2333
frequency: -49.3243 -37.4953 49.2332 66.7431 76.5011 180.7019 189.0209 226.4496 249.3323 281.0483 394.2698 398.6730 421.3912 470.8936 540.3221 598.8578 602.3800 612.6979 663.9451 674.5752 698.4413 704.8504 725.5836 751.6040 788.3719 797.1019 844.9536 851.5391 891.6228 920.8418 924.3554 969.4324 973.5842 987.6371 988.8943 992.7950 995.0670 1025.0290 1028.8012 1074.5325 1081.2584 1151.0592 1172.5109 1173.0106 1185.5469 1188.9557 1210.7471 1301.0542 1303.9635 1314.6839 1366.7488 1371.9738 1425.8895 1430.2488 1474.6742 1478.4279 1582.2761 1585.5388 1604.5141 1604.9785 1627.1646 3123.1299 3124.6129 3127.8877 3130.2102 3139.8067 3141.9309 3149.5202 3151.0990 3164.9378 3166.1182 3180.3930
redmass: 3.6978 4.0995 6.1218 7.5848 5.1172 6.3794 3.7146 6.4327 4.5832 4.9116 2.8026 2.8381 5.1948 3.5462 5.0906 4.5063 6.1306 6.4625 5.3053 5.3011 1.7752 1.7604 3.6679 1.9192 2.2830 1.3362 1.2489 1.2431 2.3734 1.8030 1.5734 1.3911 1.3828 6.1199 6.1189 1.3152 1.3241 2.4082 2.0457 1.6062 1.5999 2.4443 1.0524 1.0520 1.1114 1.1137 1.6064 2.4724 1.3922 1.3467 6.1412 7.4814 2.1981 2.2220 2.2187 2.3905 5.9671 6.0727 6.4666 6.1890 9.0728 1.0844 1.0845 1.0876 1.0878 1.0923 1.0925 1.0968 1.0968 1.1018 1.1018 1.0956
irintensity: 0.0072 0.0108 0.4975 0.0022 0.0568 0.2644 0.2382 0.8657 0.5251 0.0879 0.0241 0.0379 0.0222 6.0010 12.4324 66.0498 1.4910 0.0033 3.6720 20.0146 26.4007 80.9873 44.9867 35.8019 17.4698 33.5862 0.1763 0.4316 4.3044 2.4036 3.0706 0.0086 0.2260 1.5311 1.6600 0.0590 0.0830 4.4023 11.6950 0.0125 21.9950 0.3564 0.0045 0.0394 0.7637 0.3419 12.1421 13.2996 0.1100 1.1113 0.0078 0.0376 0.6404 14.1350 5.5205 25.3804 0.1347 4.0560 13.9902 0.7703 22.9575 3.5339 2.0259 0.0072 0.3835 24.5434 10.3568 9.4687 61.8175 23.9606 19.3230 7.6022
temp: 298.150 k
press: 1.00000 atm
elementType: 35 6 6 6 6 6 6 6 6 6 6 6 6 6 6 1 1 1 1 1 1 1 1 1 1 1
symmnumber: 1
zpe: 525561.0 jmol-1
zpe.correction: 0.200176 hartree
zpe.thermalcorrener: 0.211550 hartree
zpe.thermalcorrenthalpy: 0.212495 hartree
zpe.thermalcorrgfe: 0.160911 hartree
zpe.sumelectzpe: -552.492781 hartree
zpe.sumelectthermal: -552.481406 hartree
zpe.sumelectthermalent: -552.480462 hartree
zpe.sumelectthermalfe: -552.532046 hartree
dipole: -1.9378 1.0740 0.0032
dipole: 2.2155
quadrupole: -91.4690 -96.0878 -86.7814
quadrupole: 6.7133 0.0357 -0.0668
quadrupole: -0.0229 -4.6417 4.6646 6.7133 0.0357 -0.0668
hfenergy: -552.6929567 hartree
pointgroup: C01 [X(C14H11Br1)]
dipole: -0.5253345 0.6955218 0.0079583 debye
dipolederiv: -0.5116389 0.481793 0.0053142 0.2931501 -0.4086015 -0.0041177 0.0026924 -0.0038905 -0.0272022 0.042702 0.2831616 0.0029162 0.1119251 0.0837308 0.002277 0.0010959 0.0015606 -0.0953349 0.2797582 -0.2376612 -0.0027838 -0.1520645 -0.1111863 -0.001423 -0.0020307 -0.0013409 0.0193421 0.0676975 0.1934529 0.0020282 0.2061483 0.0636634 0.0001772 0.0022572 0.0006108 0.0241649 -0.1585863 0.0190873 -0.0702452 0.019638 -0.1541469 0.0157364 0.0020614 -0.0250322 0.0368531 -0.1288682 -0.02471 -0.050872 0.0115014 -0.1317417 -0.0468111 -0.0202092 -0.000267 0.0429616 -0.1586497 0.0168264 0.0700312 0.0198598 -0.1544228 -0.0210317 -0.0028608 0.0197401 0.0372219 -0.1285103 -0.0261101 0.0513503 0.0116939 -0.1325814 0.0421431 0.0219101 -0.0041915 0.0435463 -0.0497159 -0.0320656 0.0744621 -0.0598634 -0.1045839 -0.04192 0.0703651 -0.0157916 0.0889301 -0.0417333 0.0525381 0.0703292 0.0572355 -0.1020511 0.0474785 0.0709077 0.0215443 0.0872725 -0.0493406 -0.0301678 -0.0759095 -0.0580497 -0.1054008 0.0361625 -0.0726064 0.0112326 0.0897994 -0.0425499 0.0542679 -0.0680513 0.0589893 -0.1005224 -0.0526249 -0.0690842 -0.0268085 0.0859236 0.0247489 -0.1129518 -0.0014126 -0.0978275 -0.1005814 -0.0006366 -0.0012004 -0.0007766 -0.0664877 -0.0048583 0.1259387 0.0014904 0.1155647 -0.063544 -0.0002879 0.0013948 -0.0000926 -0.0635252 0.5819138 -0.7397751 -0.0080939 -0.521979 0.5275648 0.0084882 -0.0050981 0.0080115 -0.2588886 0.076029 0.034701 0.0978112 0.0429571 0.1135778 -0.0341272 0.0869881 -0.0343765 -0.03143 0.0746019 -0.0430425 0.0884417 -0.0473069 0.0985973 0.0564839 0.0744159 0.056167 -0.0336592 0.076472 0.0371282 -0.0962634 0.0450587 0.1115187 0.0384189 -0.0849254 0.0384931 -0.0297315 0.0740773 -0.0411784 -0.0903603 -0.0458558 0.1014323 -0.0526387 -0.0765398 -0.0525872 -0.0359179 0.0341382 0.0656504 -0.0724214 0.0655202 0.1193397 0.0416335 -0.0961839 0.0480255 -0.0673014 0.0629506 -0.0714298 -0.0683526 -0.0677462 0.0964582 -0.0477894 -0.0857235 -0.0589981 -0.0715636 0.0334294 0.0640434 0.0745919 0.0629842 0.1215209 -0.0360903 0.0985461 -0.0431446 -0.0690699 0.0637661 -0.0728546 0.065766 -0.0697887 0.0935845 0.0524688 0.0833342 0.063553 -0.0693777 -0.0794831 0.1216591 0.001461 0.126733 0.0928595 0.0002541 0.0015742 0.0002032 0.0896529 -0.0357127 -0.1450851 -0.0016194 -0.1416954 0.0489531 -0.000178 -0.0015739 -0.0001655 0.089046 -0.1026376 0.026784 0.0003918 0.0132181 -0.0034366 -0.0020455 0.0004932 -0.0016784 0.1847757 unknown
polarizability: 192.9537681|-16.5972984|142.1380261|-0.1913045|-0.2327595|141.7062427 unknown
InChI: InChI=1S/C14H11Br/c15-11-14(12-7-3-1-4-8-12)13-9-5-2-6-10-13/h1-11H
charge 0 multiplicity 1
26 atoms
Br 1.648475 -3.438718 -0.036702
C  -0.009042 -1.008995 -0.011158
C  -1.355225 -0.320961 -0.00336
C  1.211347 -0.130989 -0.002635
C  -1.988435 0.034871 -1.222421
C  1.78505 0.289793 1.224291
C  -1.992346 0.00025 1.223244
C  1.779132 0.321785 -1.220913
C  -3.236028 0.698478 -1.214603
C  2.909132 1.145393 1.2323
C  -3.239959 0.663896 1.230077
C  2.903178 1.17741 -1.211989
C  -3.864714 1.016313 0.011478
C  3.470323 1.593875 0.014446
C  0.015286 -2.363927 -0.025223
H  -1.505257 -0.214056 -2.174056
H  1.357212 -0.06179 2.170115
H  -1.512132 -0.275428 2.168984
H  1.346815 -0.005003 -2.173567
H  -3.716606 0.963867 -2.162889
H  3.347015 1.458436 2.186739
H  -3.723609 0.902427 2.183931
H  3.336414 1.515385 -2.160031
H  -4.831986 1.530964 0.01725
H  4.341959 2.257801 0.021011
H  -0.880201 -2.991276 -0.03132
