program: Gaussian 09
title: 000262911
version: EM64L-G09RevD.01
frameworkgroup: C1[X(C14H6F8)]
method: RPBEPBE
basis: SDD
operation: Freq
keyword: #pfreq=noraman
keyword: PBEPBE/SDD
title: #p freq=noraman PBEPBE/SDD
converged: NO YES NO NO
title: Mulliken charges:
elementType: F F F F F F F F C C C C C C C C C C C C C C H H H H H H
charge: -0.147883 -0.147885 -0.148044 -0.148042 -0.161563 -0.161568 -0.161528 -0.161522 0.031103 0.031104 0.115609 0.115668 0.115318 0.115258 0.201923 0.201923 0.078389 0.078439 0.078280 0.078233 -0.764307 -0.764308 0.255306 0.253682 0.253713 0.253685 0.253710 0.255307
chargesum: 0.00000
title: Mulliken charges with hydrogens summed into heavy atoms:
elementType: F F F F F F F F C C C C C C C C C C C C C C
charge: -0.147883 -0.147885 -0.148044 -0.148042 -0.161563 -0.161568 -0.161528 -0.161522 0.031103 0.031104 0.115609 0.115668 0.115318 0.115258 0.201923 0.201923 0.078389 0.078439 0.078280 0.078233 -0.001606 -0.001606
polarizability: 2.28785272e+02 3.62279651e-03 1.18891010e+02 1.14636249e+00 1.09974717e-04 1.18875856e+02
1716.lowfreq: -18.4430 -0.0008 -0.0004 0.0006 6.9706 7.3601 10.2045 42.1280 42.1311
frequency: -18.4275 42.0274 42.0697 47.0286 47.4662 118.1236 118.1262 118.9304 119.6387 160.3091 160.3190 170.7818 217.5930 217.5960 265.2838 265.2872 267.2577 273.3615 282.4522 282.4533 320.2998 347.3083 373.4331 373.4812 389.4295 396.4365 429.7879 429.7937 456.7433 483.1949 550.4629 556.4149 601.1794 601.2089 637.7872 640.3723 687.4189 697.1165 697.1280 757.6539 757.6542 882.2509 882.2578 889.1001 992.3943 1037.1687 1037.1774 1043.4755 1044.1614 1080.3940 1080.3978 1094.8429 1203.0798 1251.6863 1348.0958 1368.0700 1368.0705 1387.0798 1403.0392 1415.8984 1431.4045 1431.4079 1442.8703 1462.1614 1463.5624 1473.2857 1473.2924 1505.7893 1588.3929 1588.3942 1635.3154 1645.0298 3000.3642 3000.3807 3087.0950 3087.1021 3123.2143 3123.2152
redmass: 16.6807 5.4265 5.7020 1.0788 1.0653 7.3792 7.3793 18.5226 18.5167 6.8586 6.8554 12.7451 9.1696 9.1692 3.0096 3.0066 17.9040 18.2204 17.3010 17.3028 12.6698 9.5257 7.7611 7.7684 12.6559 12.6206 14.2018 14.2028 12.4583 16.6672 7.4181 7.8923 6.7361 6.7413 12.1740 12.1716 13.4460 6.1921 6.1923 7.6146 7.6150 5.7678 5.7676 9.5204 8.0168 3.0284 3.0286 1.4879 1.4825 3.1406 3.1402 8.5366 9.5884 10.6855 11.9437 9.2248 9.2250 3.4802 1.3816 1.5963 4.3381 4.3400 4.5754 1.0742 1.0828 1.2966 1.2964 9.3966 7.9278 7.9283 11.5189 11.6332 1.0396 1.0396 1.0939 1.0939 1.1012 1.1012
irintensity: 0.0043 1.0373 1.0166 0.1300 0.1459 1.6655 1.6678 0.0002 0.0002 0.8528 0.8554 0.0022 0.7895 0.7938 2.1406 2.1470 0.0369 0.0038 0.7943 0.7937 14.7503 0.0054 1.4443 1.4384 0.0061 0.0064 0.0369 0.0368 0.0041 0.0005 9.1290 0.0236 1.0320 0.8959 0.0027 0.0024 73.6902 0.1530 0.1537 1.9547 1.9241 92.3436 92.3302 0.0105 42.1187 44.3971 44.4282 2.4587 6.1929 32.0039 32.0191 0.0097 124.0696 0.0217 0.2579 0.0443 0.0441 0.2527 44.7411 0.4241 175.9751 176.1193 22.7853 16.6479 17.5510 97.4890 97.3968 0.3156 1.5210 1.5197 6.4628 0.0253 13.5740 0.8062 8.6804 7.3501 2.7952 2.7986
temp: 298.150 k
press: 1.00000 atm
elementType: 9 9 9 9 9 9 9 9 6 6 6 6 6 6 6 6 6 6 6 6 6 6 1 1 1 1 1 1
symmnumber: 1
zpe: 435269.2 jmol-1
zpe.correction: 0.165785 hartree
zpe.thermalcorrener: 0.185636 hartree
zpe.thermalcorrenthalpy: 0.186580 hartree
zpe.thermalcorrgfe: 0.116856 hartree
zpe.sumelectzpe: -1334.232232 hartree
zpe.sumelectthermal: -1334.212381 hartree
zpe.sumelectthermalent: -1334.211437 hartree
zpe.sumelectthermalfe: -1334.281161 hartree
dipole: 0.0000 -0.0911 0.0000
dipole: 0.0911
quadrupole: -94.5680 -131.6672 -131.6646
quadrupole: -0.0002 0.4047 0.0000
quadrupole: 24.7320 -12.3673 -12.3647 -0.0002 0.4047 0.0000
hfenergy: -1334.398017 hartree
pointgroup: C01 [X(C14H6F8)]
dipole: 0.0000014 -0.0358253 0.0010387 debye
polarizability: 228.7872207|0.0363844|118.891003|1.0481823|-0.0003752|118.8739149 unknown
InChI: InChI=1S/C14H6F8/c1-3-7(15)11(19)5(12(20)8(3)16)6-13(21)9(17)4(2)10(18)14(6)22/h1-2H3
charge 0 multiplicity 1
28 atoms
F  0.806794 1.769076 1.654708
F  -0.806416 1.664235 -1.759734
F  0.797079 -1.755072 -1.658977
F  -0.797458 -1.6499 1.763993
F  3.562627 -1.757935 -1.665693
F  -3.563115 -1.652813 1.769693
F  3.572418 1.767278 1.649997
F  -3.57193 1.663387 -1.755042
C  0.745453 0.007019 -0.001997
C  -0.745453 0.007209 0.002015
C  1.484934 0.881821 0.819737
C  -1.48475 0.83013 -0.871812
C  1.480166 -0.868893 -0.826795
C  -1.480351 -0.81662 0.878697
C  3.636357 0.003472 -0.006715
C  -3.63636 0.003987 0.006287
C  2.887272 -0.866889 -0.826703
C  -2.887455 -0.814777 0.877987
C  2.892042 0.877274 0.813985
C  -2.891861 0.826142 -0.865957
C  5.148287 -0.006143 -0.000679
C  -5.148287 -0.006274 0.000713
H  5.5304 -0.718296 0.754215
H  5.54223 -0.317655 -0.980911
H  5.545419 0.989866 0.251048
H  -5.542088 -0.258333 0.997968
H  -5.545775 0.972611 -0.310506
H  -5.530183 -0.762803 -0.709821
