program: Gaussian 09
title: 000263069
version: EM64L-G09RevD.01
frameworkgroup: C1[X(C24H27NO4S2)]
method: RPBEPBE
basis: SDD
operation: Freq
keyword: #p
keyword: freq=noraman
keyword: PBEPBE/SDD
title: #p freq=noraman PBEPBE/SDD
converged: YES YES NO NO
title: Mulliken charges:
elementType: S S O O O O N C C C C C C C C C C C C C C C C C C C C C C C C H H H H H H H H H H H H H H H H H H H H H H H H H H H
charge: 0.819456 0.863182 -0.586919 -0.580049 -0.569235 -0.566531 0.078197 -0.544109 -0.541551 -0.347070 -0.591482 -0.076862 -0.061658 0.469227 -0.258173 -0.259241 -0.246070 -0.260154 -0.416870 -0.408054 -0.365514 -0.362273 -0.365548 -0.361762 0.451484 0.449787 -0.225861 -0.231161 -0.241081 -0.800144 -0.798620 0.299722 0.300610 0.285496 0.304628 0.284464 0.270066 0.266521 0.225621 0.281158 0.284615 0.285795 0.287045 0.265753 0.240951 0.240278 0.242926 0.241555 0.243742 0.226343 0.225100 0.227219 0.229675 0.230358 0.240723 0.244571 0.230128 0.229595
chargesum: 0.00000
title: Mulliken charges with hydrogens summed into heavy atoms:
elementType: S S O O O O N C C C C C C C C C C C C C C C C C C C C C C C C
charge: 0.819456 0.863182 -0.586919 -0.580049 -0.569235 -0.566531 0.078197 0.056223 0.048572 0.207460 -0.099340 -0.076862 -0.061658 0.469227 0.022985 0.025374 0.039725 0.026891 -0.151118 -0.167102 -0.125236 -0.119347 -0.123992 -0.118021 0.451484 0.449787 0.000482 -0.006061 -0.013862 -0.099388 -0.094326
polarizability: 5.15151533e+02 -2.53324434e+01 4.17295890e+02 2.22642920e+00 -5.00071746e+00 2.21856173e+02
1716.lowfreq: -36.3654 -10.1773 -7.1056 -4.9680 -2.0903 -0.0011 -0.0008 0.0011 4.7647
frequency: -36.3356 -9.5174 -5.2340 4.8336 11.1990 16.4372 20.1746 28.9440 34.8154 36.8308 47.3100 60.7969 66.6321 75.3730 96.2446 101.0482 110.4689 111.7284 121.0027 130.9964 158.1931 180.4717 211.2399 214.0682 227.2890 247.0359 264.4916 278.8986 282.4661 287.2576 289.2614 297.4125 353.5290 368.8419 371.6311 372.6375 399.4248 403.8090 407.2032 407.5045 415.1390 438.7840 450.3006 489.4538 511.8585 513.4113 518.5967 552.0588 582.1749 585.5496 596.3763 616.9846 621.7740 621.9931 706.8988 708.0785 708.4604 756.9660 759.3101 770.6490 778.6053 783.3184 799.4766 808.0878 820.9172 823.9466 827.6029 839.5033 849.2113 852.0349 860.0546 876.9720 895.8518 929.5464 931.7104 960.3674 962.8304 980.2440 981.2762 981.7870 988.5605 989.4900 989.7192 993.7669 994.6828 997.5777 1027.0917 1036.9304 1047.3910 1048.7953 1049.2307 1049.7893 1052.4118 1070.6991 1080.7551 1102.0150 1113.4543 1115.9294 1141.0227 1159.5581 1172.3249 1180.2726 1182.5006 1190.2962 1205.5988 1217.1963 1217.4499 1223.6516 1281.2900 1291.9028 1294.6405 1307.6443 1333.7092 1336.0837 1352.7202 1378.5735 1379.5571 1385.3950 1388.8379 1390.0743 1397.4993 1399.0066 1425.9532 1437.8526 1443.9090 1466.4790 1470.3204 1470.7014 1470.8366 1471.6906 1473.6069 1473.7377 1479.7678 1487.2105 1499.6411 1591.5882 1592.3012 1594.7160 1594.7947 1594.9039 1614.9909 2972.7191 2979.1462 2980.6279 2993.3713 3037.0799 3061.5283 3063.4095 3064.6887 3091.2036 3092.3938 3095.2807 3116.2201 3117.9304 3119.4909 3130.9750 3132.2433 3132.9822 3132.9932 3134.6203 3144.6505 3155.0619 3155.8367 3158.2290 3159.1128 3162.1139 3206.0993 3234.3515
redmass: 1.0138 4.1012 1.1826 5.5939 4.3384 5.3163 5.1405 3.9564 4.6105 4.6506 5.2025 3.4115 5.2339 5.1982 6.5826 4.3396 5.1727 5.1110 4.3258 5.8416 10.7110 6.5781 7.2825 8.0677 6.7656 3.3871 4.6499 5.1383 4.9947 4.9504 4.6541 5.9870 3.4211 5.0009 3.2979 3.3873 4.5725 2.8459 2.8808 2.8493 4.3249 6.2179 4.5650 2.3598 3.4934 3.4844 3.2894 4.7723 5.5192 5.5358 5.2414 6.3604 6.9607 6.9638 3.3391 1.8693 3.2811 9.5196 1.8394 7.7240 4.9581 5.7863 2.8311 1.3662 1.8957 1.3613 1.3824 2.1656 1.2448 1.2544 1.2475 3.2414 3.3374 2.6748 1.6533 1.3072 1.2988 1.3796 1.3898 1.3805 1.4030 1.3978 6.1838 5.4401 5.4791 1.3165 2.2319 1.7287 2.4574 1.8415 1.5923 2.0403 2.5868 2.1510 1.2741 1.4511 1.2793 1.2831 1.2103 1.1654 1.0535 1.1526 1.1519 1.1357 1.3371 2.9396 2.9411 2.0928 1.3963 1.2716 1.2686 1.1972 1.3409 2.2241 1.5052 5.6035 5.6819 5.8438 3.1711 3.1263 1.2205 1.2210 1.3279 1.2931 2.0736 1.1149 2.2942 1.1117 1.1097 2.3051 1.0558 1.0584 1.6052 1.7691 1.2227 6.9031 6.9086 6.0040 5.9610 6.0289 6.0417 1.0592 1.0390 1.0388 1.0584 1.1032 1.0946 1.0948 1.1073 1.1000 1.1000 1.0550 1.0867 1.0567 1.0878 1.0887 1.0915 1.0887 1.0887 1.0887 1.0960 1.0952 1.0955 1.0968 1.0971 1.1015 1.1180 1.1180
irintensity: 0.5921 1.8042 1.0599 0.7212 0.4357 1.0622 0.4242 0.3217 0.1703 0.8907 4.2104 1.7257 1.9965 2.7962 3.9270 2.7010 11.0257 4.4153 13.2216 6.6920 11.9884 34.9302 11.8186 10.1699 202.7853 26.0301 3.5124 8.8248 14.2149 0.9117 2.7941 4.7219 5.7515 12.1309 0.4431 4.0487 23.9961 0.1275 0.2881 0.0174 29.2574 33.7243 6.9652 43.4164 74.3952 10.7629 23.1918 17.1124 13.5376 39.0387 41.2817 0.3355 0.3576 0.4047 0.8507 43.6543 2.8185 87.3928 56.2078 38.6028 7.7810 37.6637 3.2364 2.9947 8.1524 46.3612 22.3822 8.4275 1.0507 0.2263 0.3310 17.0527 92.2472 64.0475 9.7321 6.8248 1.0519 0.4578 0.0568 0.0193 1.5398 1.8872 0.2582 23.7000 7.7776 0.2944 10.1594 68.5202 24.1304 50.2946 20.8667 9.7131 27.2563 77.2656 239.6702 64.3892 10.1665 7.3861 6.4509 60.1925 0.0789 22.5889 13.3190 0.6137 2.1845 14.5519 7.2287 0.4936 133.0067 2.6155 2.5127 7.2822 11.1467 154.6958 73.1467 0.0284 0.0073 2.2463 8.2908 9.3602 15.4207 14.4588 105.5608 75.6486 14.8810 11.2071 37.4414 17.9845 14.1206 24.9327 14.2109 14.3612 38.7796 44.2979 54.1363 0.0662 0.0308 7.7846 1.4367 6.3748 10.6432 7.6650 33.2773 28.8971 14.3854 5.7921 21.8460 18.0043 4.5601 14.8126 14.4882 15.9929 7.0245 11.5415 0.6606 12.6049 11.4957 7.2198 16.6259 9.0446 32.1302 3.0473 2.2556 24.8131 20.4658 30.2294 0.8162 0.1448
temp: 298.150 k
press: 1.00000 atm
elementType: 16 16 8 8 8 8 7 6 6 6 6 6 6 6 6 6 6 6 6 6 6 6 6 6 6 6 6 6 6 6 6 1 1 1 1 1 1 1 1 1 1 1 1 1 1 1 1 1 1 1 1 1 1 1 1 1 1 1
symmnumber: 1
zpe: 1187892.5 jmol-1
zpe.correction: 0.452444 hartree
zpe.thermalcorrener: 0.483233 hartree
zpe.thermalcorrenthalpy: 0.484177 hartree
zpe.thermalcorrgfe: 0.383253 hartree
zpe.sumelectzpe: -2079.947723 hartree
zpe.sumelectthermal: -2079.916934 hartree
zpe.sumelectthermalent: -2079.915990 hartree
zpe.sumelectthermalfe: -2080.016914 hartree
dipole: -1.8940 -5.0142 -0.7118
dipole: 5.4071
quadrupole: -159.9964 -167.1103 -216.0732
quadrupole: -3.4568 28.5502 -3.7433
quadrupole: 21.0635 13.9497 -35.0132 -3.4568 28.5502 -3.7433
hfenergy: -2080.400167 hartree
pointgroup: C01 [X(C24H27N1O4S2)]
dipole: -1.0314762 1.8582974 0.0905041 debye
polarizability: 505.6269204|38.9850253|424.5200748|5.1124043|-20.8149068|224.1566 unknown
InChI: InChI=1S/C17H20NO2S.C7H7O2S/c1-15-8-10-17(11-9-15)21(19,20)14-18(2)13-12-16-6-4-3-5-7-16;1-6-2-4-7(5-3-6)10(8)9/h3-11H,2,12-14H2,1H3;2-5H,1H3
charge 0 multiplicity 1
58 atoms
S  2.346728 1.098674 0.600299
S  -2.540507 -0.310287 -1.13495
O  3.532911 -0.023008 0.878357
O  1.262386 1.483059 1.794414
O  -2.028536 0.614202 -2.401406
O  -2.712489 -1.941701 -1.281108
N  0.120355 -0.540439 -0.196764
C  0.976752 0.24749 -0.938311
C  -1.059789 0.010881 0.330792
C  0.454245 -1.948453 0.211869
C  1.679831 -2.545218 -0.510702
C  3.226272 2.707456 0.126497
C  -4.193142 0.394237 -0.540201
C  1.981461 -3.925813 0.060299
C  2.566813 3.927185 0.352291
C  -4.490291 1.737163 -0.825761
C  4.520166 2.623055 -0.413981
C  -5.073169 -0.462389 0.141793
C  2.893849 -4.061475 1.138387
C  1.335322 -5.083584 -0.442572
C  3.239928 5.11812 -0.000283
C  -5.730902 2.246004 -0.381477
C  5.172712 3.827766 -0.758391
C  -6.307358 0.070561 0.575242
C  4.541789 5.086296 -0.568307
C  -6.651765 1.426078 0.324569
C  3.155973 -5.331211 1.700747
C  1.59709 -6.354261 0.118057
C  2.508153 -6.481422 1.192491
C  5.241612 6.371435 -0.972263
C  -7.995202 1.976537 0.767473
H  1.71138 -0.262277 -1.565288
H  0.538738 1.162305 -1.351606
H  -1.463975 -0.523987 1.197866
H  -1.071676 1.102891 0.4172
H  -0.444321 -2.560065 0.011956
H  0.646813 -1.937799 1.301876
H  2.554601 -1.886932 -0.345455
H  1.474809 -2.612103 -1.596342
H  1.579244 3.940931 0.825533
H  -3.787322 2.349427 -1.400629
H  5.008435 1.648667 -0.522255
H  -4.81031 -1.513841 0.29977
H  3.400556 -3.168847 1.526225
H  0.630122 -4.990546 -1.278323
H  2.75192 6.084031 0.175257
H  -5.989669 3.290425 -0.590996
H  6.18683 3.790203 -1.173153
H  -7.013738 -0.575284 1.109559
H  3.866665 -5.423725 2.529853
H  1.094832 -7.241881 -0.283153
H  2.713566 -7.46659 1.626405
H  4.929458 7.220279 -0.339404
H  6.338934 6.275432 -0.901248
H  5.002248 6.637451 -2.020214
H  -8.757614 1.831017 -0.022152
H  -8.362958 1.468445 1.675608
H  -7.942371 3.059035 0.976411
