program: Gaussian 09
title: 000262904
version: EM64L-G09RevD.01
frameworkgroup: C1[X(C10H10INO)]
method: RPBEPBE
basis: SDD
operation: Freq
keyword: #p
keyword: freq=noraman
keyword: PBEPBE/SDD
title: #p freq=noraman PBEPBE/SDD
converged: NO YES NO NO
title: Mulliken charges:
elementType: I O N C C C C C C C C C C H H H H H H H H H H
charge: 0.085771 -0.270087 -0.216146 -0.545918 -0.368080 0.225592 0.264861 -0.298238 -0.301218 0.185867 -0.369799 -0.142179 -0.769380 0.245851 0.245898 0.237716 0.237607 0.257937 0.315418 0.248456 0.230170 0.269567 0.230335
chargesum: 0.00000
title: Mulliken charges with hydrogens summed into heavy atoms:
elementType: I O N C C C C C C C C C C
charge: 0.085771 -0.270087 -0.216146 -0.054169 0.107243 0.225592 0.264861 -0.040301 0.014200 0.185867 -0.369799 0.106277 -0.039308
polarizability: 2.38522456e+02 -1.26175765e+00 1.30998099e+02 1.14284690e-02 8.24244982e-03 6.11271748e+01
1716.lowfreq: -40.2287 -9.7971 -4.2190 -0.0001 0.0006 0.0006 11.6036 49.5344 97.3054
frequency: -40.1488 49.5058 97.3036 118.7107 138.2483 144.8358 179.4636 214.7419 238.8279 335.1165 353.7459 408.9149 426.6257 484.1340 536.4517 565.5331 583.0609 598.6420 658.2044 714.4135 725.4071 829.0561 834.4007 839.7755 884.1747 909.0897 971.8919 991.5011 1015.6743 1028.6541 1048.1629 1053.2888 1097.6118 1114.1733 1173.3634 1179.7123 1226.0519 1229.1407 1264.2181 1281.1948 1318.3382 1361.2847 1373.5635 1384.5366 1413.4512 1446.1811 1460.1151 1467.7955 1475.0755 1490.7769 1578.9841 1591.3462 1605.7698 2983.2648 2997.7777 3010.6512 3043.3320 3066.6474 3067.8248 3134.4885 3151.0003 3164.4757 3207.1480
redmass: 1.8208 4.6853 3.0916 7.0770 1.2315 4.0544 10.9675 3.5650 4.9207 6.4135 3.7339 6.5001 2.9591 4.2785 3.4094 4.7318 3.1035 5.6437 6.0489 3.3509 5.4961 1.2603 5.2216 1.4514 1.3345 4.1790 1.3301 2.7258 2.1614 1.6613 1.7219 2.0842 4.1741 2.7288 1.8024 1.1560 1.6184 1.0811 2.2085 1.4483 1.7696 3.9769 1.8354 2.0447 3.5300 1.1026 1.5039 1.0479 1.6950 1.1560 7.2997 7.7983 8.0367 1.0385 1.0580 1.0608 1.1058 1.0979 1.1054 1.0980 1.0933 1.0916 1.0951
irintensity: 0.8730 0.5353 3.6796 2.8051 0.0934 2.1822 0.0136 4.2922 8.3496 1.0329 5.1448 2.0797 8.2049 2.9373 8.6795 0.0037 0.0001 5.8329 28.3917 1.9562 1.2072 12.7042 17.4142 42.9723 12.6404 27.2336 2.9291 0.0328 10.2500 4.1332 2.8646 11.3190 25.1614 5.7988 22.8867 0.3151 19.5513 0.3493 14.9580 13.6114 175.5315 77.8004 24.5852 181.0994 1.7278 32.0891 103.7899 22.5398 166.1363 32.5729 157.4967 14.9278 61.1268 8.7506 24.8852 59.2374 0.6764 19.8271 30.0252 8.2552 3.8930 2.9711 4.4001
temp: 298.150 k
press: 1.00000 atm
elementType: 53 8 7 6 6 6 6 6 6 6 6 6 6 1 1 1 1 1 1 1 1 1 1
symmnumber: 1
zpe: 462577.1 jmol-1
zpe.correction: 0.176186 hartree
zpe.thermalcorrener: 0.187595 hartree
zpe.thermalcorrenthalpy: 0.188539 hartree
zpe.thermalcorrgfe: 0.136849 hartree
zpe.sumelectzpe: -527.625047 hartree
zpe.sumelectthermal: -527.613639 hartree
zpe.sumelectthermalent: -527.612694 hartree
zpe.sumelectthermalfe: -527.664385 hartree
dipole: 2.8360 4.6172 -0.0014
dipole: 5.4186
quadrupole: -81.1945 -89.0204 -93.1431
quadrupole: 16.1872 -0.0048 0.0076
quadrupole: 6.5915 -1.2344 -5.3571 16.1872 -0.0048 0.0076
hfenergy: -527.8012336 hartree
pointgroup: C01 [X(C10H10I1N1O1)]
dipole: -0.9881844 1.8889903 0.0004924 debye
dipolederiv: -0.6155246 0.0500046 0.0002744 0.0329818 -0.0362985 -0.0000245 0.0004032 -0.0000421 -0.0148592 -0.649446 0.0447736 0.0000792 -0.6203266 -1.0697045 0.0001159 -0.0004642 -0.0003944 -0.3499791 -1.8493172 -0.330015 0.0004086 -0.3195567 -0.6060936 -0.0003629 0.0007436 0.0003783 -0.1827677 -0.0532177 0.0155097 0.0001714 0.0742878 -0.01393 0.0000918 0.0002149 0.0004323 0.1722014 0.1855801 -0.0830185 0.000027 -0.1829873 0.3926548 0.0006199 -0.000526 0.000241 0.2926342 -0.1990684 -0.0957358 0.000184 -0.2008782 0.1737 -0.0001007 0.0003914 -0.0005423 -0.0694741 1.1674306 -0.0994991 -0.000519 -0.1756923 -0.1486821 0.0000707 -0.0006835 0.0000499 0.0694496 -0.2971021 0.1578399 -0.0000377 0.0052646 0.0350412 -0.0000472 -0.0002702 -0.0001415 -0.1071416 -0.1451862 0.019373 0.0000022 0.0577519 -0.0156147 -0.0001248 0.0000844 -0.0000604 -0.1492882 1.6883488 0.3121249 -0.0000292 0.9904093 1.2976037 -0.000142 0.0005877 0.0002557 0.1547533 1.2054705 -0.1310312 -0.000634 0.026632 -0.0837138 -0.0000633 -0.000753 0.0000975 -0.1740039 -0.4276998 -0.0208721 0.000201 0.0239108 0.0646499 -0.000173 0.0004702 -0.000089 -0.1021688 -0.4001156 0.1176007 -0.0000474 0.2243311 -0.0686898 0.0001439 -0.0010048 0.0003959 0.0640003 0.0370059 0.0042451 -0.0203433 -0.0022584 -0.0228238 -0.0819034 -0.0065891 -0.1369219 -0.0256807 0.0368153 0.004861 0.0201484 -0.0020368 -0.0221674 0.0818686 0.0064698 0.1369696 -0.0266404 -0.0255951 0.061059 0.0846561 0.0443013 0.0031405 -0.0212665 0.1252379 -0.0666399 -0.053939 -0.0264179 0.0616101 -0.0847347 0.0445451 0.0035399 0.0210729 -0.1250229 0.0660753 -0.0528487 0.0641453 -0.0662829 0.0000768 -0.07795 -0.014462 0.0001452 0.0001358 0.0001287 0.1560963 0.1119396 -0.0520812 0.0000742 0.0020288 0.0724134 0.0000807 0.0000464 0.0000583 0.1837407 0.0610373 0.0701553 -0.0000308 0.0696334 -0.0199742 0.0001168 0.0000455 0.0000532 0.1578054 0.0588656 0.0067608 -0.0244177 0.0619707 0.0368322 -0.1110539 0.0341296 -0.103803 -0.0339512 0.0134176 -0.0542939 0.0002799 -0.1382902 0.0045323 0.0004058 0.0005741 0.0002361 0.1268358 0.0586339 0.0069119 0.0242107 0.061928 0.0380466 0.1105301 -0.0342208 0.1032628 -0.0347745 unknown
polarizability: 238.1869827|-6.1277159|131.3335431|-0.0620715|-0.0235487|61.1272043 unknown
InChI: InChI=1S/C10H10INO/c1-7(13)12-5-4-8-6-9(11)2-3-10(8)12/h2-3,6H,4-5H2,1H3
charge 0 multiplicity 1
23 atoms
I  4.826157 -0.439432 -0.001908
O  -2.37858 -1.936351 0.000615
N  -1.501532 0.227153 0.001165
C  -0.221515 2.300026 -0.001361
C  -1.670055 1.716377 0.001955
C  0.671001 1.066721 -0.000566
C  -0.116464 -0.112969 0.000592
C  2.073486 0.994397 -0.001283
C  0.483563 -1.392727 0.001009
C  -2.56618 -0.680099 0.001322
C  2.675127 -0.287903 -0.000812
C  1.897901 -1.466698 0.000304
C  -3.9646 -0.068972 0.001199
H  -0.041074 2.932386 0.886217
H  -0.043752 2.92892 -0.891963
H  -2.235048 2.032791 0.896845
H  -2.239602 2.033356 -0.889794
H  2.683456 1.903075 -0.002241
H  -0.131045 -2.293237 0.001795
H  2.380701 -2.447877 0.000634
H  -4.133023 0.563745 0.892756
H  -4.692937 -0.892486 0.003809
H  -4.13438 0.559004 -0.89349
