program: Gaussian 09
title: 000262900
version: EM64L-G09RevD.01
frameworkgroup: C1[X(C8H4F5NO2)]
method: RPBEPBE
basis: SDD
operation: Freq
keyword: #p
keyword: freq=noraman
keyword: PBEPBE/SDD
title: #p freq=noraman PBEPBE/SDD
converged: NO YES NO NO
title: Mulliken charges:
elementType: F F F F F O O N C C C C C C C C H H H H
charge: -0.143313 -0.143347 -0.144269 -0.144258 -0.141686 -0.220069 -0.209607 -0.613348 0.084147 0.162038 0.161917 0.115345 0.115332 0.119657 -0.368283 0.213637 0.243521 0.244017 0.350276 0.318293
chargesum: 0.00000
title: Mulliken charges with hydrogens summed into heavy atoms:
elementType: F F F F F O O N C C C C C C C C
charge: -0.143313 -0.143347 -0.144269 -0.144258 -0.141686 -0.220069 -0.209607 0.055221 0.084147 0.162038 0.161917 0.115345 0.115332 0.119657 0.119255 0.213637
polarizability: 1.44233209e+02 2.44699485e-02 9.85963271e+01 -1.68777027e+00 7.42887570e-02 6.56801758e+01
1716.lowfreq: -87.1254 -25.2100 -6.3168 -0.0012 -0.0012 -0.0010 3.4048 5.1842 29.9969
frequency: -87.1085 -25.1112 29.9165 51.4439 123.0869 131.2108 166.8884 177.4253 219.1861 250.6200 254.8199 260.1232 288.2085 304.3002 345.0657 358.2536 421.8350 424.7410 442.3767 446.7294 521.2023 522.2970 548.8119 621.1611 626.6498 627.9156 656.5427 729.9383 747.8907 830.9075 905.8303 921.2990 988.5785 994.2541 1052.5900 1073.3530 1101.3925 1200.4539 1226.8564 1275.7312 1343.9730 1362.8135 1409.4366 1448.8680 1454.5999 1463.2420 1597.9311 1603.2666 1613.3515 1674.0131 2964.6578 3027.8054 3512.8174 3666.6142
redmass: 2.7113 5.4640 6.5887 9.2933 18.5620 10.8167 12.5748 11.9231 10.3127 15.8085 18.2851 14.9978 15.7656 14.7343 6.9201 12.5868 12.9024 6.2787 1.3368 10.1403 7.5194 1.3834 9.8146 9.0157 3.7626 2.2811 9.2587 12.5247 10.2167 3.2242 10.0393 14.3040 1.9529 9.7532 2.0153 13.3442 13.3703 1.0697 8.6655 2.0955 11.9957 2.3442 7.0425 2.3698 12.2575 1.6953 12.0122 1.2848 10.2971 5.5937 1.0544 1.1068 1.0450 1.1043
irintensity: 3.0271 13.4959 1.6696 3.3370 0.0000 3.4898 2.6592 0.6855 3.7248 0.0867 0.0967 0.1620 2.2174 4.6349 0.7816 0.0139 0.2150 0.1343 39.4675 1.9305 12.9509 176.9145 4.9108 1.1903 33.9560 66.0253 1.2134 0.2017 1.1740 2.5078 69.9470 173.9192 0.3205 176.0298 1.0898 0.2600 62.1295 1.1452 29.3220 159.1677 1.8314 18.4372 25.7122 230.3749 225.4264 65.6313 1.4597 75.0626 0.5330 285.0590 32.6026 16.5723 41.5336 30.3651
temp: 298.150 k
press: 1.00000 atm
elementType: 9 9 9 9 9 8 8 7 6 6 6 6 6 6 6 6 1 1 1 1
symmnumber: 1
zpe: 299145.8 jmol-1
zpe.correction: 0.113939 hartree
zpe.thermalcorrener: 0.127515 hartree
zpe.thermalcorrenthalpy: 0.128459 hartree
zpe.thermalcorrgfe: 0.072702 hartree
zpe.sumelectzpe: -1010.426910 hartree
zpe.sumelectthermal: -1010.413334 hartree
zpe.sumelectthermalent: -1010.412390 hartree
zpe.sumelectthermalfe: -1010.468147 hartree
dipole: 2.6384 0.0228 5.4572
dipole: 6.0616
quadrupole: -84.4866 -98.2398 -85.2101
quadrupole: 0.1150 22.4150 0.0161
quadrupole: 4.8256 -8.9277 4.1021 0.1150 22.4150 0.0161
hfenergy: -1010.5408485 hartree
pointgroup: C01 [X(C8H4F5N1O2)]
dipole: -0.9906461 0.0073385 -2.1693019 debye
dipolederiv: -0.324324 -0.3168084 0.0275998 -0.2766085 -0.7435299 0.0431707 0.0278933 0.025137 -0.0898533 -0.324562 0.3171115 0.0276539 0.276797 -0.743327 -0.0431458 0.0279216 -0.0250024 -0.0898589 -0.4095775 -0.3437539 0.0197915 -0.4078185 -0.7426174 0.0246587 0.0365563 0.0437824 -0.0823215 -0.4099374 0.343948 0.0197555 0.4079695 -0.7422698 -0.0245648 0.0364678 -0.0436612 -0.0823079 -1.0284681 -0.0001842 0.07134 -0.0002115 -0.1558848 0.0000198 0.0963899 0.0000193 -0.0859852 -1.3598158 -0.0003361 -0.2180357 -0.0008439 -0.3107152 -0.0001443 -0.2524797 -0.0002481 -0.2468401 -0.6999076 -0.000662 0.1820723 0.0008766 -0.3201208 0.0031874 -0.0653971 0.0035127 -0.9767356 -0.8803411 0.002928 -0.5311355 0.0025581 -0.7213294 0.0000956 -0.4285971 0.0001042 -0.724113 1.1917048 0.0003264 0.0184212 0.0002234 0.0102704 -0.0001186 -0.1871223 -0.0000887 -0.0291991 0.1725213 0.4140813 -0.0427096 0.3827663 0.7811944 -0.0609628 -0.0228756 -0.041038 0.0795892 0.1727655 -0.4143837 -0.0427805 -0.3828775 0.7808603 0.060993 -0.0231251 0.040851 0.0795391 0.3402718 0.4604105 -0.0192252 0.5029364 0.775883 -0.0374098 -0.0361995 -0.0514859 0.0712982 0.3407523 -0.4606779 -0.0191889 -0.5031668 0.7754966 0.0372774 -0.036062 0.0513994 0.0712916 1.1023799 0.0002235 -0.0877545 0.0002445 0.0617496 -0.0000108 -0.0970793 -0.0000204 0.0760458 0.3345322 0.0004752 0.2853872 0.0015726 0.3875864 0.0003304 0.7773345 0.0003372 0.2995139 1.4140168 -0.0030398 0.2554328 -0.0046319 0.2040672 -0.0069688 0.2807398 -0.0068416 1.4798973 -0.0129941 -0.026828 -0.0041733 -0.0044529 -0.0346479 0.1068279 -0.094 0.0654609 -0.0261102 -0.0130223 0.0271211 -0.0039031 0.004212 -0.0346287 -0.1064553 -0.0937983 -0.0649978 -0.0254176 0.1849326 0.0001376 0.0191999 0.0006322 0.3912367 0.0013706 -0.0073993 0.0012682 0.1694295 0.2090728 -0.0000891 0.0422523 -0.0001772 0.3807263 0.0018496 0.0608319 0.0015116 0.1321377 unknown
polarizability: 144.2694394|-0.0197011|98.5961975|0.0379963|-0.0988513|65.6440746 unknown
InChI: InChI=1S/C8H4F5NO2/c9-3-4(10)6(12)8(7(13)5(3)11)16-1-2(14)15/h1,14H2
charge 0 multiplicity 1
20 atoms
F  -0.091007 -2.421018 0.207931
F  -0.092201 2.420703 0.207443
F  2.68332 2.420883 -0.089123
F  2.684506 -2.419891 -0.088666
F  4.072294 0.000823 -0.232118
O  -1.499402 -0.000417 0.524154
O  -4.166158 -0.007142 1.054111
N  -4.761192 0.005479 -1.194277
C  -0.133344 -0.000168 0.235862
C  0.592299 -1.213037 0.146269
C  0.591705 1.213039 0.146028
C  1.991576 1.219776 -0.006777
C  1.992172 -1.219112 -0.006549
C  2.693236 0.000497 -0.080925
C  -2.37771 -0.001448 -0.660337
C  -3.838229 -0.001653 -0.157332
H  -2.187052 0.903319 -1.272117
H  -2.18681 -0.907099 -1.270728
H  -5.752194 0.005215 -0.952621
H  -4.49401 0.01135 -2.177929
