program: Gaussian 09
title: 000024222
version: EM64L-G09RevD.01
frameworkgroup: C1[X(C15H25NO3)]
method: RPBEPBE
basis: SDD
operation: Freq
keyword: #p
keyword: freq=noraman
keyword: PBEPBE/SDD
title: #p freq=noraman PBEPBE/SDD
converged: YES YES NO NO
title: Mulliken charges:
elementType: O O O N C C C C C C C C C C C C C C C H H H H H H H H H H H H H H H H H H H H H H H H H
charge: -0.339820 -0.478977 -0.276136 -0.368105 0.334409 -0.066062 -0.451006 -0.732293 -0.762144 -0.358651 -0.426114 0.327477 -0.240014 -0.345825 -0.349857 -0.211317 -0.212033 -0.245633 -0.499531 0.203988 0.240508 0.231715 0.224806 0.209027 0.265004 0.225980 0.237625 0.219163 0.262363 0.212340 0.207083 0.357427 0.210964 0.224720 0.199968 0.183002 0.241065 0.230625 0.226636 0.224514 0.228520 0.201648 0.200371 0.232569
chargesum: 0.00000
title: Mulliken charges with hydrogens summed into heavy atoms:
elementType: O O O N C C C C C C C C C C C C C C C
charge: -0.339820 -0.121550 -0.276136 -0.105742 0.334409 0.137925 0.021217 -0.033457 -0.079375 0.060772 0.009570 0.327477 0.142956 -0.104760 -0.119232 0.015320 0.012482 -0.017113 0.135058
polarizability: 2.25437305e+02 -9.19539357e+00 1.81500606e+02 -1.31743815e+01 3.44053408e+00 1.34564649e+02
1716.lowfreq: -16.9357 -6.8715 -5.4035 -0.0004 0.0001 0.0005 5.1290 15.9337 25.5560
frequency: -11.7920 14.6442 25.5249 37.1456 46.5703 69.7582 80.6444 92.9344 106.2963 113.5698 153.2910 184.7385 204.3389 207.3863 219.0851 233.4521 248.6715 253.5905 265.0097 295.1163 308.6800 336.3857 373.3014 394.3963 407.9353 412.7250 431.1303 481.2808 528.6450 535.0037 561.4806 595.6133 611.5696 645.6830 693.8768 698.7204 771.0870 780.9808 799.7589 810.1874 832.8883 850.5779 867.9540 875.2112 907.6028 909.3122 931.1272 931.8140 964.1936 974.0067 987.0847 987.9083 994.9132 1018.7446 1034.3362 1035.5356 1058.6209 1066.2927 1070.0355 1096.9048 1106.5572 1119.3502 1130.8430 1135.1767 1155.7428 1162.5380 1167.2344 1168.0557 1192.7792 1208.4519 1220.9086 1235.4735 1256.8083 1274.8767 1294.9505 1299.3585 1308.8531 1317.1351 1326.2660 1368.4861 1372.3155 1372.6484 1385.6013 1385.9612 1406.8476 1433.9758 1438.6918 1441.2414 1457.1764 1457.4718 1463.5185 1467.6067 1468.0854 1470.3155 1474.5558 1475.9459 1487.4025 1491.9914 1492.8246 1587.5549 1599.1435 2902.3715 2911.3584 2913.0866 2925.4543 2962.4884 2972.3846 2991.0874 2991.7488 2995.2004 2997.8447 3011.5444 3050.6875 3059.3371 3089.0964 3097.5757 3101.4332 3101.8362 3106.5207 3125.0462 3133.3360 3150.2127 3158.4269 3169.5577 3248.1136 3405.1666
redmass: 4.1482 4.3264 3.4096 3.7441 2.1349 4.2272 2.9415 3.8281 3.4741 3.4844 3.1495 2.5458 1.3373 1.9648 1.3562 1.4034 2.4156 2.2058 2.3475 3.0192 4.1297 2.8347 3.4904 4.0730 3.0145 2.9186 3.8437 3.1808 2.7329 2.9777 3.4544 3.5087 6.5108 1.2036 2.9289 2.0863 1.5463 1.7828 2.6143 1.1977 1.2431 4.0887 2.0271 2.6002 2.5885 1.6961 1.6136 1.6190 1.3716 1.8168 1.3158 5.8110 1.4275 2.0549 2.4716 2.0146 3.7235 5.0650 1.5629 2.2447 1.4653 1.5964 2.2054 2.6785 1.3808 1.3282 1.3300 1.0613 2.4556 2.3510 1.3996 1.9347 1.2540 1.1816 1.3757 1.2839 1.3433 1.2719 1.2934 1.3676 7.6582 1.2826 1.2778 1.3803 1.5487 2.2327 1.1588 1.1932 1.0514 1.0614 1.1538 1.1724 1.4492 1.1640 1.0838 1.0844 1.0806 1.0690 1.0789 6.4588 6.2132 1.0696 1.0816 1.0549 1.0389 1.0649 1.1001 1.0356 1.0663 1.1026 1.0352 1.0872 1.0965 1.1009 1.1003 1.0993 1.0996 1.0970 1.0996 1.0846 1.0886 1.0926 1.0960 1.1008 1.0636 1.0738
irintensity: 0.0883 0.1982 0.0240 0.6337 6.2510 4.4461 1.7650 3.3364 2.1406 4.9443 2.6268 3.3503 1.0363 1.6712 2.7721 1.7131 0.1641 0.3686 3.2297 1.5587 6.0375 2.0586 3.9110 5.2741 1.6466 0.1095 2.3668 4.1624 9.9464 5.8876 0.7630 12.8596 0.0329 41.4497 33.5860 10.7861 96.7157 8.3458 19.0899 61.0442 0.2829 75.5617 11.4621 6.0470 7.8584 9.5562 0.8356 7.4955 0.1232 49.7223 0.3796 0.3513 4.5991 16.3207 12.3391 30.3090 0.4040 144.5746 25.3539 5.5502 4.6306 22.2238 141.6531 139.1109 4.4431 8.7481 10.1020 0.1985 52.7259 30.1378 4.5356 27.2457 14.4628 1.2619 0.7603 2.0314 24.5290 5.4569 0.1520 14.2016 0.1631 39.0458 11.5047 10.7990 52.9928 1.8610 1.3182 30.9531 11.8580 10.9277 15.7210 38.6355 46.3857 19.6987 3.0254 2.9722 15.0661 12.5188 5.9538 6.9050 41.3094 92.1428 55.6578 58.3482 89.3058 56.1853 59.8461 18.7201 14.1239 70.3898 14.8547 42.0675 28.6435 54.7552 20.3625 36.9859 8.6711 34.8372 23.6664 3.1829 6.5826 37.3827 29.7882 7.6770 197.6974 0.2748
temp: 298.150 k
press: 1.00000 atm
elementType: 8 8 8 7 6 6 6 6 6 6 6 6 6 6 6 6 6 6 6 1 1 1 1 1 1 1 1 1 1 1 1 1 1 1 1 1 1 1 1 1 1 1 1 1
symmnumber: 1
zpe: 987379.2 jmol-1
zpe.correction: 0.376073 hartree
zpe.thermalcorrener: 0.396839 hartree
zpe.thermalcorrenthalpy: 0.397783 hartree
zpe.thermalcorrgfe: 0.324403 hartree
zpe.sumelectzpe: -865.463840 hartree
zpe.sumelectthermal: -865.443074 hartree
zpe.sumelectthermalent: -865.442129 hartree
zpe.sumelectthermalfe: -865.515509 hartree
dipole: -0.6214 -0.7473 -0.0254
dipole: 0.9722
quadrupole: -112.3750 -112.9342 -118.8458
quadrupole: -6.5213 -3.7912 2.0570
quadrupole: 2.3433 1.7842 -4.1275 -6.5213 -3.7912 2.0570
hfenergy: -865.8399127 hartree
pointgroup: C01 [X(C15H25N1O3)]
dipole: 0.2610853 -0.2792789 -0.0122542 debye
polarizability: 224.0672131|12.6014737|183.0721912|-12.6183496|-0.6950875|134.3631554 unknown
InChI: InChI=1S/C15H25NO3/c1-15(2,19-13-8-5-4-6-9-13)14(17)12-16-10-7-11-18-3/h4-6,8-9,14,16-17H,7,10-12H2,1-3H3
charge 0 multiplicity 1
44 atoms
O  -2.284386 0.739895 -0.834934
O  0.822337 1.475928 1.165452
O  6.295661 -0.540016 0.428375
N  2.024497 -0.204176 -0.555347
C  -1.36998 1.547846 0.0744
C  -0.080343 0.705202 0.302213
C  0.701535 0.331938 -0.981572
C  -2.030441 1.854161 1.428008
C  -1.104787 2.828487 -0.728652
C  3.083352 -0.191421 -1.598501
C  4.415108 -0.753112 -1.064762
C  -3.069814 -0.311364 -0.302012
C  5.006152 0.06977 0.085545
C  -4.389843 -0.045784 0.138709
C  -2.588326 -1.644105 -0.325597
C  -5.215109 -1.107623 0.570722
C  -3.420593 -2.701654 0.105934
C  -4.733402 -2.438029 0.561061
C  6.951146 0.142568 1.540853
H  -0.380599 -0.230865 0.829404
H  0.897628 1.246487 -1.569018
H  0.112629 -0.359718 -1.619032
H  -2.281376 0.929896 1.977948
H  -2.951661 2.447215 1.29143
H  -1.316673 2.429663 2.040941
H  -0.868068 2.590521 -1.779686
H  -0.258919 3.375543 -0.27793
H  -1.999238 3.474147 -0.72301
H  1.930943 -1.145923 -0.143245
H  3.219404 0.858939 -1.922951
H  2.784367 -0.771123 -2.503493
H  1.727174 1.096098 0.929012
H  4.283054 -1.799977 -0.725941
H  5.150668 -0.780004 -1.890347
H  4.330858 0.065048 0.968467
H  5.153039 1.129074 -0.228648
H  -4.757457 0.985298 0.121875
H  -1.580798 -1.844684 -0.704908
H  -6.236089 -0.896597 0.908529
H  -3.04573 -3.73132 0.080566
H  -5.376732 -3.259786 0.893878
H  6.331263 0.109509 2.462811
H  7.167783 1.205413 1.298079
H  7.898265 -0.390866 1.718576
