program: Gaussian 09
title: 000262928
version: EM64L-G09RevD.01
frameworkgroup: C1[X(C21H25N3)]
method: RPBEPBE
basis: SDD
operation: Freq
keyword: #pfreq=noraman
keyword: PBEPBE/SDD
title: #p freq=noraman PBEPBE/SDD
converged: YES YES NO NO
title: Mulliken charges:
elementType: N N N C C C C C C C C C C C C C C C C C C C C C H H H H H H H H H H H H H H H H H H H H H H H H H
charge: -0.155359 -0.486667 -0.059069 0.442778 -0.398696 -0.395833 0.292316 0.071360 0.463716 0.251689 -0.026834 -0.394271 -0.388715 -0.402651 -0.396761 -0.438937 -0.583055 0.492267 -0.661616 -0.662118 -0.346913 -0.361341 -0.846811 -0.824369 0.226222 0.221762 0.225869 0.220768 0.309805 0.224588 0.226539 0.264949 0.239831 0.232901 0.234536 0.217575 0.239623 0.214163 0.216433 0.241823 0.214689 0.243905 0.224087 0.230907 0.262244 0.206382 0.228439 0.219328 0.228524
chargesum: 0.00000
title: Mulliken charges with hydrogens summed into heavy atoms:
elementType: N N N C C C C C C C C C C C C C C C C C C C C C
charge: -0.155359 -0.176862 -0.059069 0.442778 0.049288 0.050804 0.292316 0.071360 0.463716 0.251689 -0.026834 -0.169684 -0.162176 -0.137702 -0.156931 -0.206036 -0.348519 0.492267 0.009744 0.010828 -0.103008 -0.137254 -0.147278 -0.148078
polarizability: 6.62482705e+02 8.15155734e-01 2.31176876e+02 -5.24880862e-01 1.37677728e+01 1.37348250e+02
1716.lowfreq: -3.9982 -2.9363 -0.0011 -0.0005 0.0014 9.3836 20.0429 24.9332 34.9362
frequency: 20.0286 24.9053 34.9143 50.8650 60.0828 66.1296 81.9530 93.6190 100.3876 104.8252 129.6847 161.0144 177.1361 185.3609 207.8057 210.8098 219.4276 259.6047 277.8082 300.9204 316.9576 332.9543 337.3339 373.4282 394.8014 396.9241 417.1201 431.9180 437.1112 480.4582 494.0904 514.9133 520.0992 540.9651 545.9218 586.6422 606.4759 611.9451 634.0615 675.0419 704.1343 719.1994 739.5286 757.1495 767.8992 783.6463 786.5679 803.6847 807.6358 818.7730 822.3174 834.4355 863.0068 892.3196 921.0170 924.2425 929.9899 937.4928 949.6921 953.9895 959.6162 988.0704 998.7597 1003.4697 1016.4326 1036.7218 1043.9573 1072.8938 1076.3238 1094.3467 1096.7214 1129.5112 1134.8738 1159.1338 1160.7624 1202.3302 1204.9750 1218.2450 1228.3777 1258.9451 1267.9169 1270.0459 1289.1677 1300.6968 1318.2795 1327.8957 1341.1301 1351.1929 1355.2083 1381.3151 1383.9811 1384.7358 1387.0470 1396.3539 1396.9748 1403.2991 1441.7256 1448.2719 1465.9670 1467.0627 1469.0914 1469.4857 1473.7434 1476.0129 1481.8803 1485.7519 1491.3631 1496.8056 1503.0295 1519.2455 1527.0810 1543.5642 1586.3499 1615.3595 1632.2920 1637.9528 2958.9714 2971.3134 2982.4781 2982.8210 2986.5360 2992.3439 3032.4481 3035.6302 3041.3683 3047.9746 3078.0015 3078.4673 3078.7605 3087.2973 3091.3734 3092.7662 3095.3381 3121.0139 3121.3104 3129.1907 3145.1500 3160.5823 3163.0794 3170.3339 3606.9564
redmass: 4.4489 3.8160 4.4036 3.4432 1.3032 2.1823 3.1837 2.9635 4.1454 3.4816 2.8238 3.1822 3.2684 2.3744 1.0953 1.2508 2.2228 2.7328 3.4066 2.9419 2.8876 3.1436 2.8322 3.9186 2.8297 4.2901 3.7971 2.9212 3.0329 3.3738 3.2063 4.0725 2.7045 3.7306 2.6244 1.2328 2.9991 4.4643 6.7673 4.1514 5.6192 4.1975 4.0951 4.9881 3.5622 1.2171 1.2050 1.3586 2.1890 1.4700 2.4005 4.4487 1.4724 2.3256 1.9890 2.6875 1.9934 2.8909 1.3824 1.3322 1.4347 2.5385 2.2323 1.5330 2.7869 1.4462 1.5310 2.1638 1.8257 1.6680 2.0877 1.4405 1.6091 2.0912 1.9335 1.6196 1.8892 1.5498 2.0679 2.1347 1.5424 2.6137 1.2162 2.1380 2.5454 1.9809 1.3072 1.3319 2.7345 1.6397 3.2902 1.2330 1.2620 1.3867 1.2812 2.0267 3.6435 3.7582 1.0483 1.0451 1.2513 1.0794 1.1694 1.0625 1.0596 2.6508 1.0858 1.2393 1.2106 2.2650 2.6452 5.7727 7.1522 6.4745 6.3799 7.3115 1.0400 1.0370 1.0358 1.0357 1.0602 1.0607 1.0969 1.1029 1.1024 1.0977 1.0985 1.0996 1.0995 1.0950 1.1010 1.1008 1.0881 1.0888 1.0889 1.0921 1.0862 1.0932 1.0955 1.0951 1.0805
irintensity: 1.2873 1.6009 0.7500 0.0120 0.1352 0.4979 0.4218 0.8329 0.6552 1.2485 0.7807 0.1179 0.7721 1.0462 0.6380 0.1667 1.7875 2.9338 3.0864 0.5845 0.4654 1.9000 1.7180 4.0641 4.8602 1.9218 13.7062 2.0732 4.3575 14.2311 6.7648 18.5627 16.1091 1.9649 6.5241 60.8599 34.3503 8.4217 0.4715 0.7684 0.8831 3.6806 9.6445 1.8056 0.7038 14.1207 12.0159 5.5634 20.5004 47.9638 51.9048 3.4498 10.2257 0.1019 5.4508 14.9255 5.6820 0.4780 4.9661 1.0070 12.6025 4.4884 15.8709 27.3994 39.8513 1.5413 12.8188 13.6783 47.0646 18.1635 22.7026 4.9867 5.0418 6.9542 49.6823 88.3547 70.8352 15.6045 12.5112 73.3523 113.6334 23.3890 3.3391 16.9477 25.6967 23.6255 19.4051 184.3633 11.0288 31.2649 7.3400 3.4833 37.6176 81.5662 24.3265 113.7313 8.3945 23.2962 5.8982 6.9144 24.3200 11.6403 10.9398 0.1175 4.5549 63.7169 27.5064 29.5818 56.5359 2.9146 456.7772 4.9901 0.6855 434.4043 202.7484 7.8528 46.6288 77.2820 34.0587 33.8165 52.6835 94.8587 32.9916 6.1911 15.7827 23.8852 20.5331 30.9241 68.2681 14.4386 9.4567 94.5904 2.6121 11.1805 23.4097 27.0384 18.9884 38.2448 15.9461 18.4162 29.1318
temp: 298.150 k
press: 1.00000 atm
elementType: 7 7 7 6 6 6 6 6 6 6 6 6 6 6 6 6 6 6 6 6 6 6 6 6 1 1 1 1 1 1 1 1 1 1 1 1 1 1 1 1 1 1 1 1 1 1 1 1 1
symmnumber: 1
zpe: 1078172.8 jmol-1
zpe.correction: 0.410654 hartree
zpe.thermalcorrener: 0.434195 hartree
zpe.thermalcorrenthalpy: 0.435140 hartree
zpe.thermalcorrgfe: 0.355928 hartree
zpe.sumelectzpe: -977.757919 hartree
zpe.sumelectthermal: -977.734378 hartree
zpe.sumelectthermalent: -977.733434 hartree
zpe.sumelectthermalfe: -977.812645 hartree
dipole: 4.6687 -3.1731 -0.9942
dipole: 5.7319
quadrupole: -99.6279 -129.2001 -150.5755
quadrupole: 9.7596 3.1489 3.7834
quadrupole: 26.8399 -2.7322 -24.1077 9.7596 3.1489 3.7834
hfenergy: -978.1685732 hartree
pointgroup: C01 [X(C21H25N3)]
dipole: 1.8453775 -0.1155289 1.2910043 debye
polarizability: 662.4330976|3.8394063|135.7536489|-3.22936|5.871475|232.8210841 unknown
InChI: InChI=1S/C21H25N3/c1-5-24(6-2)18-10-8-17(9-11-18)14-16(4)21-22-19-12-7-15(3)13-20(19)23-21/h7-14,23H,5-6H2,1-4H3
charge 0 multiplicity 1
49 atoms
N  5.863616 -0.043939 -0.13101
N  -3.344644 -0.360149 1.292762
N  -2.736079 -0.090511 -0.891839
C  4.46402 -0.063415 -0.125223
C  6.639643 0.16536 1.107196
C  6.635478 -0.238021 -1.374808
C  -4.544785 -0.245731 0.580569
C  -2.275033 -0.261373 0.373143
C  1.550975 -0.1247 -0.101436
C  -0.869034 -0.329526 0.786737
C  -4.137358 -0.079605 -0.788712
C  3.712269 0.237844 1.057907
C  3.709601 -0.366707 -1.306715
C  0.091791 -0.165061 -0.192585
C  2.309092 0.201056 1.065281
C  2.308473 -0.378384 -1.286452
C  -5.897919 -0.26849 0.974719
C  -6.880557 -0.121664 -0.032676
C  6.886633 1.656116 1.441468
C  6.895633 -1.724215 -1.718382
C  -5.127047 0.065142 -1.790211
C  -6.479031 0.042378 -1.398196
C  -0.581719 -0.614653 2.253245
C  -8.359493 -0.137175 0.318695
H  6.12972 -0.335506 1.951039
H  7.612354 -0.349008 0.988622
H  6.117287 0.26249 -2.21384
H  7.603002 0.285927 -1.257248
H  -3.252122 -0.471397 2.299584
H  4.226268 0.534943 1.976539
H  4.219195 -0.602239 -2.245156
H  -0.315739 -0.063581 -1.209164
H  1.794909 0.49234 1.985637
H  1.769221 -0.611231 -2.213216
H  -6.194724 -0.396079 2.022145
H  7.438236 2.154548 0.62387
H  5.933829 2.19523 1.582584
H  7.483247 1.753104 2.367804
H  7.456339 -2.221619 -0.906353
H  5.947462 -2.271533 -1.858389
H  7.488241 -1.809758 -2.648346
H  -4.835756 0.191778 -2.837289
H  -7.259735 0.153914 -2.160905
H  -0.59102 0.303029 2.875463
H  0.405283 -1.089584 2.372321
H  -1.323458 -1.317397 2.679547
H  -8.888848 -0.956322 -0.20437
H  -8.519283 -0.273795 1.40247
H  -8.853438 0.80797 0.022879
