program: Gaussian 09
title: 000262927
version: EM64L-G09RevD.01
frameworkgroup: C1[X(C20H22ClN3)]
method: RPBEPBE
basis: SDD
operation: Freq
keyword: #p
keyword: freq=noraman
keyword: PBEPBE/SDD
title: #p freq=noraman PBEPBE/SDD
converged: NO YES NO NO
title: Mulliken charges:
elementType: Cl N N N C C C C C C C C C C C C C C C C C C C C H H H H H H H H H H H H H H H H H H H H H H
charge: -0.080731 -0.154243 -0.483732 -0.058289 0.443610 -0.398921 -0.396113 0.465458 -0.393416 -0.387995 0.253029 0.076580 -0.394032 -0.437536 0.306313 -0.397797 -0.014011 -0.660773 -0.661272 -0.844839 -0.374975 -0.330875 -0.071543 -0.221392 0.223049 0.226791 0.226368 0.222030 0.226005 0.227972 0.240054 0.233277 0.265047 0.315368 0.218158 0.239203 0.215533 0.216051 0.241484 0.217031 0.232477 0.262988 0.206572 0.259199 0.251998 0.250841
chargesum: 0.00000
title: Mulliken charges with hydrogens summed into heavy atoms:
elementType: Cl N N N C C C C C C C C C C C C C C C C C C C C
charge: -0.080731 -0.154243 -0.168364 -0.058289 0.443610 0.050919 0.052285 0.465458 -0.167410 -0.160023 0.253029 0.076580 -0.153978 -0.204260 0.306313 -0.132751 -0.014011 0.012122 0.013295 -0.142802 -0.115776 -0.078877 -0.071543 0.029449
polarizability: 6.84177746e+02 -1.95147067e+00 2.26402076e+02 3.89674695e-01 -1.41114502e+01 1.29577365e+02
1716.lowfreq: -3.9216 -2.5762 -0.0007 0.0009 0.0012 10.7110 18.0876 24.5248 32.7691
frequency: 18.0730 24.4288 32.7537 50.1030 63.0527 81.9332 91.9409 95.8179 103.7456 127.9603 150.1114 158.6212 178.7246 208.8561 211.0342 215.6490 250.5958 267.0163 292.1194 303.2097 325.0414 333.9921 341.4275 385.5164 393.0400 408.5523 428.9137 433.8291 434.8336 492.3308 501.6962 519.3622 538.8652 546.4699 582.8661 593.7036 600.2303 632.7972 673.8888 678.3867 705.4486 720.4658 741.2042 752.2843 783.9815 787.2692 803.5853 806.3398 813.5150 820.3285 831.9539 847.9485 892.7434 899.6447 921.7343 924.1196 931.1898 944.4498 950.9333 961.1065 987.9992 998.9337 1016.5731 1036.9114 1046.4420 1073.2366 1076.3032 1094.4851 1095.4149 1121.2243 1135.4016 1161.2416 1201.5875 1204.6670 1214.8375 1222.0564 1240.2613 1262.1078 1269.3364 1284.2707 1289.2134 1314.8387 1325.7572 1341.1401 1351.1278 1354.7971 1381.9599 1385.4371 1385.9447 1387.8338 1397.4162 1404.6223 1438.9463 1443.7733 1459.4624 1466.3562 1467.4375 1471.9011 1476.4568 1482.0541 1491.8613 1493.4733 1503.8862 1513.6706 1526.9812 1542.7276 1584.4547 1612.8290 1625.3010 1632.3812 2959.3041 2982.8760 2983.4093 2988.4181 2993.9250 3032.9898 3037.4083 3043.0309 3079.0365 3079.5250 3087.9105 3091.4690 3093.0016 3095.7744 3121.4080 3146.6377 3158.5331 3161.9180 3166.4272 3171.7606 3178.4408 3606.2127
redmass: 6.6393 4.2257 5.2870 4.1418 3.4155 3.2362 3.6279 4.2179 3.5625 2.9770 5.2686 6.7549 2.1695 1.1517 1.1409 2.2231 3.3180 4.5354 2.9913 2.9932 6.4159 2.6038 5.1806 4.0979 3.2678 3.7448 3.0188 3.6994 3.1444 3.1890 3.7198 2.4550 3.8291 2.6571 2.1407 3.8773 1.7555 6.9294 4.1348 7.9694 5.6412 4.1326 3.8795 3.2501 1.2247 1.2031 1.4711 2.1199 1.5994 2.2954 3.9482 1.4944 2.3341 5.7889 2.0590 3.6772 1.6678 1.3385 1.3792 1.4388 2.5838 2.2491 2.7871 1.4442 2.0516 2.1710 1.8275 1.6785 2.0492 1.4381 1.6274 1.9239 1.7272 1.8266 1.3652 2.6199 1.8711 3.3150 1.3952 2.1823 1.2138 3.1301 1.6241 1.3035 1.3331 2.6108 1.6664 1.2757 3.4680 1.2650 1.3993 2.0307 3.3491 3.6999 4.6365 1.0486 1.0441 1.1074 1.0628 1.0494 1.0980 1.4957 1.2122 2.0200 2.5232 5.6273 8.1825 6.4666 7.6945 6.3481 1.0401 1.0357 1.0357 1.0603 1.0609 1.0969 1.1029 1.1024 1.0996 1.0996 1.0949 1.1011 1.1009 1.0881 1.0889 1.0862 1.0883 1.0931 1.0935 1.0951 1.0975 1.0807
irintensity: 0.4435 0.6998 0.1567 0.3176 0.4884 0.4309 0.4671 0.0894 1.3132 2.0554 1.6833 0.0816 0.8844 0.6623 0.1309 1.7103 2.6778 4.1657 1.5707 1.5381 2.2626 4.1078 9.7151 1.7208 6.8886 13.6199 11.3434 1.6196 4.4991 9.0578 14.0205 24.1321 3.0296 5.7954 10.7264 35.4253 69.4054 0.5445 1.3214 15.7349 1.0434 6.3355 14.5144 1.4318 14.2866 11.7026 7.7584 10.9802 46.7319 49.9877 6.4970 35.8687 0.1929 44.4571 5.7037 15.7689 8.9252 0.3812 4.3830 15.0404 5.6039 25.1009 42.3496 1.4706 31.0287 13.5379 50.4677 18.8383 23.2761 5.6413 7.7368 60.2122 85.3739 79.7068 43.2425 23.7183 71.8714 29.2298 120.8598 30.9359 3.0992 38.1411 13.0599 16.9500 201.3060 15.1752 60.2521 10.3273 12.0059 37.6876 127.7700 124.1219 103.8512 10.7903 53.6178 5.7105 9.2331 0.4090 0.0462 1.7561 22.1512 45.9308 57.1892 84.9307 489.3963 5.2306 9.9283 553.1490 14.3380 206.8246 44.9179 33.8319 33.5338 52.4743 93.7730 32.1702 5.8238 14.4488 37.1384 59.6599 13.5257 12.5487 90.9578 2.1699 9.6805 17.6695 1.7239 37.1862 2.5477 18.8504 7.3810 33.4474
temp: 298.150 k
press: 1.00000 atm
elementType: 17 7 7 7 6 6 6 6 6 6 6 6 6 6 6 6 6 6 6 6 6 6 6 6 1 1 1 1 1 1 1 1 1 1 1 1 1 1 1 1 1 1 1 1 1 1
symmnumber: 1
zpe: 981945.6 jmol-1
zpe.correction: 0.374003 hartree
zpe.thermalcorrener: 0.397004 hartree
zpe.thermalcorrenthalpy: 0.397948 hartree
zpe.thermalcorrgfe: 0.319739 hartree
zpe.sumelectzpe: -1397.919604 hartree
zpe.sumelectthermal: -1397.896604 hartree
zpe.sumelectthermalent: -1397.895660 hartree
zpe.sumelectthermalfe: -1397.973869 hartree
dipole: -8.3544 -2.7828 0.8851
dipole: 8.8501
quadrupole: -136.4650 -132.6114 -155.7392
quadrupole: -5.3571 2.3573 -4.3019
quadrupole: 5.1402 8.9938 -14.1340 -5.3571 2.3573 -4.3019
hfenergy: -1398.2936076 hartree
pointgroup: C01 [X(C20H22Cl1N3)]
dipole: 3.2886031 -0.1506403 1.1339908 debye
polarizability: 684.0957895|-6.1187922|128.0729353|-3.1874004|6.7046566|227.9884619 unknown
InChI: InChI=1S/C20H22ClN3/c1-4-24(5-2)17-9-6-15(7-10-17)12-14(3)20-22-18-11-8-16(21)13-19(18)23-20/h6-13,23H,4-5H2,1-3H3
charge 0 multiplicity 1
46 atoms
Cl -8.620581 0.101519 0.28353
N  5.849962 -0.083952 -0.117111
N  -3.369108 -0.215201 1.244276
N  -2.737528 0.001383 -0.940897
C  4.451791 -0.079698 -0.11978
C  6.623126 0.110155 1.126163
C  6.626477 -0.290426 -1.356766
C  1.5385 -0.092014 -0.114069
C  3.697543 0.232034 1.059843
C  3.699589 -0.367754 -1.307068
C  -0.890729 -0.245365 0.75931
C  -2.289767 -0.155988 0.330933
C  2.294606 0.218631 1.058566
C  2.298923 -0.355654 -1.295569
C  -4.558682 -0.089557 0.520979
C  0.0809 -0.108959 -0.215021
C  -4.137272 0.043301 -0.851042
C  6.895249 1.595793 1.462463
C  6.86332 -1.780584 -1.699225
C  -0.621572 -0.518116 2.231558
C  -5.912596 -0.076986 0.909695
C  -5.110088 0.190089 -1.868117
C  -6.840438 0.073457 -0.137707
C  -6.472197 0.204894 -1.50215
H  7.586759 -0.421512 1.011436
H  6.1001 -0.382812 1.966425
H  6.121895 0.21956 -2.198274
H  7.601558 0.217319 -1.232012
H  4.210648 0.518864 1.982117
H  4.211208 -0.609812 -2.242647
H  1.780206 0.516382 1.976597
H  1.761687 -0.577424 -2.226206
H  -0.317042 -0.012911 -1.235917
H  -3.285877 -0.309937 2.253784
H  7.459265 2.084878 0.64771
H  5.952067 2.152372 1.600557
H  7.489848 1.680904 2.391195
H  7.460349 -1.875162 -2.625372
H  5.907043 -2.311808 -1.845981
H  7.41061 -2.287985 -0.884265
H  -0.608145 0.407742 2.84147
H  0.350777 -1.019139 2.363154
H  -1.384534 -1.194382 2.663128
H  -6.240649 -0.176658 1.947719
H  -4.806725 0.290855 -2.913949
H  -7.250974 0.317366 -2.261661
