program: Gaussian 09
title: 000262889
version: EM64L-G09RevD.01
frameworkgroup: C1[X(C12H22OSi2)]
method: RPBEPBE
basis: SDD
operation: Freq
keyword: #p
keyword: freq=noraman
keyword: PBEPBE/SDD
title: #p freq=noraman PBEPBE/SDD
converged: YES YES NO NO
title: Mulliken charges:
elementType: Si Si O C C C C C C C C C C C C H H H H H H H H H H H H H H H H H H H H H H
charge: 1.333844 1.364638 -0.632313 -0.302935 0.343789 -1.046540 -1.024787 -1.024911 -0.296870 -1.025041 -1.025969 -1.026238 -0.380994 -0.265010 -0.232497 0.236898 0.234675 0.235071 0.232420 0.224388 0.254711 0.255525 0.224284 0.232309 0.241039 0.248446 0.231535 0.250458 0.252608 0.246320 0.236289 0.235884 0.247284 0.251799 0.223245 0.224428 0.222216
chargesum: 0.00000
title: Mulliken charges with hydrogens summed into heavy atoms:
elementType: Si Si O C C C C C C C C C C C C
charge: 1.333844 1.364638 -0.632313 -0.302935 0.343789 -0.339897 -0.313267 -0.312793 -0.055831 -0.294602 -0.290751 -0.291270 -0.157749 -0.040582 -0.010281
polarizability: 2.04780131e+02 -5.07744117e+00 2.01427448e+02 1.98962490e-01 -5.65531368e-02 1.34296752e+02
1716.lowfreq: -7.5195 -5.7874 -0.0011 -0.0001 0.0015 9.2353 24.7022 33.0730 55.1393
frequency: 24.0639 33.0691 55.0748 64.6142 80.4335 93.3860 111.9704 116.7634 118.6238 127.3140 127.8571 163.7045 167.2553 171.6955 177.1050 190.0448 196.2898 201.5362 207.5650 225.8574 254.6767 259.6247 290.8936 356.7622 402.4377 452.1811 525.3448 537.5520 587.2138 599.7489 648.2506 689.2867 693.1320 696.6266 697.7772 707.5819 727.0400 743.1596 746.9866 762.9325 803.3435 809.2895 816.4914 818.6342 857.7204 873.5202 901.3652 903.4302 910.4637 911.8511 914.2721 930.6892 941.2765 975.7410 1035.8318 1061.0547 1126.5754 1171.8126 1229.2544 1264.6877 1279.2173 1283.9675 1298.0371 1304.0943 1304.3136 1316.1887 1358.0064 1418.2183 1433.9738 1438.2003 1442.5966 1445.6249 1446.3866 1447.0460 1447.6608 1449.8100 1451.1993 1457.7368 1459.9786 1462.0217 1467.5983 1574.2876 1588.2034 2977.2425 2981.3362 2982.1237 2985.8324 2986.6045 2988.7537 3078.6985 3080.3368 3082.2522 3083.1394 3085.3191 3086.2399 3091.7847 3096.6634 3097.8181 3098.1316 3098.4137 3099.8562 3118.6348 3126.5906 3143.5186 3160.0193
redmass: 3.2268 2.7645 3.5068 3.6244 1.2853 1.7722 1.0966 1.9929 1.2745 1.0992 1.0504 2.5868 2.3383 2.8475 1.1517 2.5899 2.6404 2.5956 2.8085 2.9338 3.7028 3.3184 4.6513 5.1985 5.3265 3.2033 6.8705 3.5095 4.4684 4.4101 5.3529 3.3421 3.2153 5.5281 2.8431 2.7871 1.9428 1.1718 1.1922 1.7141 1.3590 1.3870 1.4101 1.3848 1.4288 4.5832 1.5048 1.4805 1.5534 1.5584 1.5465 1.7459 1.3722 1.3158 3.2449 3.1752 1.6898 1.0573 3.2736 1.4595 1.2053 1.2105 1.2007 1.2031 1.2100 1.1905 10.3856 2.0691 1.0536 1.0540 1.0549 1.0533 1.1190 1.0541 1.0810 1.0618 1.0552 1.0527 1.3506 1.2704 1.1391 6.5391 5.9884 1.0342 1.0337 1.0337 1.0351 1.0350 1.0347 1.0980 1.0988 1.0982 1.0977 1.0975 1.0975 1.0977 1.0987 1.0982 1.0981 1.0986 1.0981 1.0845 1.0890 1.0930 1.1004
irintensity: 0.5106 0.0106 0.4003 0.1888 0.3122 0.0935 0.0216 0.0921 0.0513 0.0266 0.0178 0.5891 0.0135 0.3938 0.0262 0.3443 1.5507 0.8855 0.0106 0.7248 19.6840 3.2491 0.0487 20.8793 20.3835 5.9461 3.8692 0.0219 0.8663 8.4724 13.2036 15.7948 10.0924 11.2692 9.8948 8.7314 19.2852 0.0395 0.0179 59.7917 27.1024 27.3836 11.7268 10.0330 3.9235 40.7119 54.3856 101.9650 66.4876 271.5555 129.9472 301.8074 0.5045 0.1008 2.4000 33.3281 20.7418 3.5503 243.3025 55.0951 43.0470 16.9615 27.0927 55.4008 53.5885 41.8056 6.1167 85.2075 0.8364 0.3991 0.9515 1.5784 24.6330 8.6509 12.1454 0.2344 0.5239 9.9296 8.3733 63.8981 35.4111 20.7021 59.3123 16.1595 21.3571 19.2646 9.8528 9.2135 8.6156 5.8055 2.0445 26.1650 47.9276 3.0457 17.6849 34.8544 5.2593 9.1980 22.3451 6.4465 27.8288 5.1394 6.5783 48.3393 29.8155
temp: 298.150 k
press: 1.00000 atm
elementType: 14 14 8 6 6 6 6 6 6 6 6 6 6 6 6 1 1 1 1 1 1 1 1 1 1 1 1 1 1 1 1 1 1 1 1 1 1
symmnumber: 1
zpe: 797875.8 jmol-1
zpe.correction: 0.303895 hartree
zpe.thermalcorrener: 0.325574 hartree
zpe.thermalcorrenthalpy: 0.326518 hartree
zpe.thermalcorrgfe: 0.252880 hartree
zpe.sumelectzpe: -1123.390178 hartree
zpe.sumelectthermal: -1123.368498 hartree
zpe.sumelectthermalent: -1123.367554 hartree
zpe.sumelectthermalfe: -1123.441192 hartree
dipole: 2.4520 -0.0122 -0.0197
dipole: 2.4521
quadrupole: -97.0603 -104.2368 -111.4355
quadrupole: -0.5062 -0.0019 0.0005
quadrupole: 7.1839 0.0074 -7.1913 -0.5062 -0.0019 0.0005
hfenergy: -1123.6940724 hartree
pointgroup: C01 [X(C12H22O1Si2)]
dipole: -0.9629037 -0.0589536 0.0050142 debye
polarizability: 205.4141645|-4.7920856|200.7541049|-1.2856116|1.1362392|134.3360622 unknown
InChI: InChI=1S/C12H22OSi2/c1-14(2,3)12-10-8-7-9-11(12)13-15(4,5)6/h7-10H,1-6H3
charge 0 multiplicity 1
37 atoms
Si 1.897039 1.4629 -0.007488
Si -2.724649 0.458595 0.039203
O  -0.957761 0.380881 0.026067
C  1.321263 -0.369631 -0.028513
C  -0.067401 -0.695671 -0.008336
C  3.814466 1.478791 -0.054853
C  1.302088 2.325991 1.594852
C  1.228517 2.390134 -1.543507
C  2.244229 -1.446422 -0.062598
C  -3.03127 2.330393 0.066729
C  -3.411352 -0.3417 -1.548609
C  -3.388779 -0.379811 1.617041
C  -0.505892 -2.045167 -0.021569
C  1.82329 -2.797669 -0.076619
C  0.442179 -3.091394 -0.05591
H  4.184478 2.520927 -0.038921
H  4.248674 0.95629 0.817719
H  4.202392 0.999716 -0.972976
H  1.738037 1.844638 2.489356
H  1.593551 3.393095 1.600871
H  0.202571 2.2597 1.6665
H  0.125442 2.352358 -1.551081
H  1.546876 3.449551 -1.533932
H  1.598571 1.927855 -2.476912
H  3.318736 -1.227438 -0.078792
H  -2.634206 2.80784 -0.846744
H  -4.111321 2.556945 0.131893
H  -2.530038 2.792414 0.93593
H  -2.955847 0.124897 -2.440629
H  -3.209351 -1.426118 -1.593897
H  -4.506266 -0.196385 -1.610449
H  -4.489245 -0.281165 1.672386
H  -3.141797 -1.455196 1.655638
H  -2.959072 0.098215 2.515757
H  -1.575647 -2.282151 -0.004891
H  2.561737 -3.606211 -0.103206
H  0.097854 -4.132195 -0.066012
