program: Gaussian 09
title: 000262869
version: EM64L-G09RevD.01
frameworkgroup: C1[X(C10H16OSi)]
method: RPBEPBE
basis: SDD
operation: Freq
keyword: #p
keyword: freq=noraman
keyword: PBEPBE/SDD
title: #p freq=noraman PBEPBE/SDD
converged: YES YES NO NO
title: Mulliken charges:
elementType: Si O C C C C C C C C C C H H H H H H H H H H H H H H H H
charge: 1.285796 -0.483256 -0.939984 -0.669895 -1.020354 -1.030022 0.483359 -0.412618 -0.383866 -0.226361 -0.232451 -0.250074 0.263547 0.234830 0.215309 0.229212 0.229900 0.231106 0.256900 0.234452 0.254392 0.234020 0.225793 0.256990 0.346735 0.221141 0.220910 0.224489
chargesum: 0.00000
title: Mulliken charges with hydrogens summed into heavy atoms:
elementType: Si O C C C C C C C C C C
charge: 1.285796 -0.136521 -0.441607 -0.225374 -0.302447 -0.307158 0.483359 -0.186825 -0.126876 -0.005220 -0.011541 -0.025586
polarizability: 1.63919437e+02 2.21973403e+00 1.36005338e+02 1.57848265e+01 1.58711949e+00 9.67537536e+01
1716.lowfreq: -9.4837 -0.0017 -0.0017 -0.0010 6.4572 20.4146 35.3528 56.6983 67.6013
frequency: 34.4568 56.5070 67.5675 89.4048 121.4203 130.1915 133.1587 165.5640 178.7894 196.1986 204.4669 264.5811 306.3872 326.2654 335.3705 406.9810 470.0586 552.4161 579.9537 616.9131 669.0978 678.0390 703.2839 709.0932 737.7787 764.8069 781.3971 805.4934 839.2101 851.2290 860.7424 905.7749 911.1317 925.8025 935.6789 979.7207 988.1055 994.0369 1027.2823 1063.5437 1130.5372 1163.4857 1170.1559 1173.8895 1184.7031 1189.4796 1216.8805 1292.2875 1302.4971 1323.1368 1327.9056 1379.3016 1438.9276 1441.5839 1445.2931 1449.4526 1452.7964 1454.8759 1459.6699 1480.7615 1587.3195 1611.0859 2935.1307 2979.8459 2982.0107 2990.8430 2993.2308 3056.2230 3079.9535 3083.3651 3086.0078 3092.2000 3111.1154 3114.2335 3129.3677 3138.4283 3158.5782 3544.3515
redmass: 3.5199 3.8215 4.6758 3.5318 2.9364 1.1028 1.0248 3.0798 2.4983 2.7376 2.7370 2.2851 1.3479 4.2505 2.1791 2.8841 3.7089 4.8048 3.2635 6.2282 3.1353 3.7299 2.8638 1.7598 1.3073 1.6348 1.6202 2.9243 1.6680 1.5158 1.2811 1.6610 1.5489 1.4650 6.6817 1.3906 5.4020 1.3213 2.2099 1.5565 1.1221 1.0474 1.0503 1.2096 1.1129 1.1222 3.3107 1.2021 1.2046 1.3647 1.2781 7.7247 2.1832 1.0956 1.0661 1.0579 1.0735 1.0517 1.0533 2.2858 5.9984 6.0165 1.0539 1.0344 1.0341 1.0587 1.1042 1.1011 1.0980 1.0980 1.0983 1.0985 1.0860 1.0869 1.0914 1.0961 1.1013 1.0669
irintensity: 0.4851 1.3339 0.4189 4.0459 1.1919 0.0395 0.0272 0.9414 6.5744 6.1082 2.3141 20.8035 142.8024 15.6389 6.2374 0.1084 11.6977 1.7353 21.2781 0.1808 0.4706 8.7446 13.7393 49.8730 0.1293 30.3799 8.0514 11.0279 55.9837 26.8139 0.6132 92.2125 154.3538 18.1600 31.7184 0.2974 0.7192 1.1792 8.0749 20.2722 1.1878 18.4084 0.6060 23.3825 28.4720 4.1356 22.2630 36.3941 36.1343 4.5571 1.5779 1.2132 6.6671 4.3306 6.4725 0.9675 11.6632 5.0170 17.4525 34.8095 1.3991 26.8261 45.7507 14.4623 15.9734 17.5141 50.2363 5.4857 7.7140 28.8263 17.5161 11.3230 10.3821 0.2409 8.8416 43.7145 29.8583 0.3549
temp: 298.150 k
press: 1.00000 atm
elementType: 14 8 6 6 6 6 6 6 6 6 6 6 1 1 1 1 1 1 1 1 1 1 1 1 1 1 1 1
symmnumber: 1
zpe: 607217.3 jmol-1
zpe.correction: 0.231277 hartree
zpe.thermalcorrener: 0.246061 hartree
zpe.thermalcorrenthalpy: 0.247005 hartree
zpe.thermalcorrgfe: 0.189127 hartree
zpe.sumelectzpe: -754.361610 hartree
zpe.sumelectthermal: -754.346827 hartree
zpe.sumelectthermalent: -754.345882 hartree
zpe.sumelectthermalfe: -754.403761 hartree
dipole: -0.9069 0.3045 1.5937
dipole: 1.8588
quadrupole: -79.6499 -71.7320 -82.5087
quadrupole: -0.7455 -0.1464 4.7312
quadrupole: -1.6863 6.2316 -4.5452 -0.7455 -0.1464 4.7312
hfenergy: -754.5928872 hartree
pointgroup: C01 [X(C10H16O1Si1)]
dipole: 0.3728509 0.1113884 -0.6191872 debye
polarizability: 163.097191|-3.174766|136.2019799|17.019204|-1.9569422|97.3793579 unknown
InChI: InChI=1S/C10H16OSi/c1-12(2,9-11)8-10-6-4-3-5-7-10/h3-7,11H,8-9H2,1-2H3
charge 0 multiplicity 1
28 atoms
Si 2.016067 -0.530719 -0.079328
O  2.130248 2.204237 0.046399
C  0.599754 -0.480771 1.241044
C  2.023114 1.16014 -1.003843
C  3.694581 -0.760388 0.805552
C  1.702308 -1.918786 -1.357825
C  -0.770972 -0.220357 0.64839
C  -1.656559 -1.286845 0.334925
C  -1.194197 1.108086 0.36467
C  -2.923876 -1.037254 -0.239815
C  -2.461104 1.359643 -0.207202
C  -3.333495 0.288323 -0.513387
H  0.876962 0.319975 1.952493
H  0.617889 -1.438911 1.795735
H  2.883133 1.205791 -1.707593
H  1.089343 1.278319 -1.594025
H  3.688498 -1.648888 1.463653
H  4.516892 -0.883507 0.076627
H  3.914887 0.128497 1.423963
H  1.774686 -2.914541 -0.881932
H  0.693964 -1.827648 -1.801157
H  2.443524 -1.885547 -2.17799
H  -1.352068 -2.318834 0.55148
H  -0.514147 1.937382 0.597052
H  2.197844 3.096706 -0.378403
H  -3.592719 -1.875725 -0.467305
H  -2.77064 2.391861 -0.410102
H  -4.317716 0.483562 -0.954075
