program: Gaussian 09
title: 000262885
version: EM64L-G09RevD.01
frameworkgroup: C1[X(C12H18O2Si)]
method: RPBEPBE
basis: SDD
operation: Freq
keyword: #p
keyword: freq=noraman
keyword: PBEPBE/SDD
title: #p freq=noraman PBEPBE/SDD
converged: YES YES NO NO
title: Mulliken charges:
elementType: Si O O C C C C C C C C C C C C H H H H H H H H H H H H H H H H H H
charge: 1.252095 -0.265407 -0.256899 -0.935940 -0.671296 -1.023099 -1.018055 0.493658 -0.393196 -0.404451 -0.229882 -0.226250 0.305306 -0.248274 -0.748533 0.240486 0.251672 0.265457 0.260948 0.243134 0.254553 0.233738 0.233811 0.235742 0.259467 0.247198 0.226505 0.224596 0.223317 0.226869 0.249389 0.248072 0.245269
chargesum: 0.00000
title: Mulliken charges with hydrogens summed into heavy atoms:
elementType: Si O O C C C C C C C C C C C C
charge: 1.252095 -0.265407 -0.256899 -0.443782 -0.144890 -0.291675 -0.289035 0.493658 -0.145997 -0.177946 -0.005286 -0.002933 0.305306 -0.021405 -0.005803
polarizability: 1.97276712e+02 2.53515690e+00 1.62693563e+02 1.84301766e+01 3.98394372e+00 1.13551637e+02
1716.lowfreq: -22.4624 -17.4954 -8.5383 0.0009 0.0011 0.0013 9.7009 13.9142 24.8548
frequency: -21.7369 12.9383 24.4723 25.2949 54.6299 64.2847 69.9761 75.3984 101.1569 141.4234 148.6257 175.7379 184.6282 201.3065 266.9737 294.0555 305.2002 328.4537 405.1560 431.9188 468.9962 551.9255 566.5157 589.3290 599.9612 617.0318 665.9038 681.3256 705.4831 707.6375 721.7932 759.1456 767.6676 797.2346 815.6875 836.0716 847.6067 857.1193 899.4367 908.6328 920.9822 949.7398 976.5257 988.1239 992.2018 1000.6767 1026.6940 1044.3870 1060.9035 1125.5743 1171.0936 1173.4264 1188.8337 1192.4334 1216.3057 1229.1118 1274.6017 1295.0326 1303.7331 1325.3349 1379.1563 1382.6566 1419.0065 1438.6010 1440.2509 1443.0522 1447.0799 1451.0421 1456.7484 1457.6820 1458.7263 1480.8185 1588.0899 1611.1610 1643.1775 2982.1443 2984.3426 2986.6484 3007.4144 3009.3277 3049.0545 3083.1977 3084.3133 3088.7384 3092.1110 3095.2191 3096.1954 3112.8835 3114.9213 3130.9129 3138.3501 3140.8929 3160.9780
redmass: 1.1108 3.5975 5.2190 3.2471 2.5723 3.1887 2.7280 1.4937 1.0681 3.2573 3.5954 3.9324 2.9103 2.8935 4.2734 2.2818 4.6662 1.9197 2.8496 3.4832 3.7358 4.7370 3.3468 3.7624 3.6905 6.2190 3.2901 3.6746 2.3314 1.9730 1.5732 1.8496 1.9297 3.5622 1.7919 1.8178 1.6399 1.2962 1.6107 1.7265 1.4838 4.7710 1.3884 6.0080 1.3095 1.8667 2.2019 1.6124 1.5212 1.1349 1.0500 1.2704 1.1551 2.6907 3.3613 1.1995 1.3198 1.1982 1.1919 1.2787 7.8326 1.2230 1.0905 1.7992 1.1666 1.1050 1.0639 1.0529 1.0678 1.0479 1.0510 2.3106 5.9942 6.0878 9.5204 1.0342 1.0362 1.0567 1.0369 1.0560 1.1011 1.0982 1.0977 1.0990 1.1040 1.0984 1.0966 1.0866 1.0871 1.0910 1.1014 1.0959 1.1014
irintensity: 0.3909 0.9435 2.7660 0.5319 0.2563 0.2192 0.2063 0.5145 0.1842 1.2389 0.6562 3.9953 0.5466 4.8369 7.7503 8.1747 14.9233 0.1045 0.0071 2.4000 15.7057 1.2696 7.2421 13.1003 1.6266 0.2413 4.3374 6.0957 27.7717 28.0949 11.6913 30.4630 16.5337 18.5202 9.1028 50.3330 9.0407 0.9701 120.8736 149.9298 17.5932 20.7270 0.3439 0.3873 0.9048 36.7056 7.2414 10.9621 24.1114 3.3857 0.1575 35.7990 19.7647 246.6176 19.3759 71.6714 55.3619 39.5780 23.3693 0.8097 1.4781 51.8898 20.0049 10.8090 0.1009 13.3205 1.2631 8.9246 18.1579 10.1972 18.4828 34.0284 1.6672 24.6751 184.7105 13.1173 5.8407 24.1285 3.3576 16.9474 7.3185 8.4056 23.0089 10.0199 7.7300 10.5007 7.2162 9.5645 4.5532 9.4538 9.9918 43.5165 26.2314
temp: 298.150 k
press: 1.00000 atm
elementType: 14 8 8 6 6 6 6 6 6 6 6 6 6 6 6 1 1 1 1 1 1 1 1 1 1 1 1 1 1 1 1 1 1
symmnumber: 1
zpe: 703324.9 jmol-1
zpe.correction: 0.267882 hartree
zpe.thermalcorrener: 0.285567 hartree
zpe.thermalcorrenthalpy: 0.286512 hartree
zpe.thermalcorrgfe: 0.218529 hartree
zpe.sumelectzpe: -906.799616 hartree
zpe.sumelectthermal: -906.781931 hartree
zpe.sumelectthermalent: -906.780987 hartree
zpe.sumelectthermalfe: -906.848970 hartree
dipole: -0.9464 -0.1669 0.8587
dipole: 1.2888
quadrupole: -103.7356 -89.4867 -99.0679
quadrupole: -6.9225 8.9104 1.3905
quadrupole: -6.3055 7.9434 -1.6378 -6.9225 8.9104 1.3905
hfenergy: -907.0674985 hartree
pointgroup: C01 [X(C12H18O2Si1)]
dipole: -0.3779776 0.0672561 -0.3312032 debye
polarizability: 194.7291023|-7.9912578|164.2943314|-20.67057|0.7048956|114.4984776 unknown
InChI: InChI=1S/C12H18O2Si/c1-11(13)14-10-15(2,3)9-12-7-5-4-6-8-12/h4-8H,9-10H2,1-3H3
charge 0 multiplicity 1
33 atoms
Si 0.540386 -1.676754 0.097009
O  2.114095 0.685433 0.027586
O  4.115098 -0.323029 0.687426
C  -0.698819 -1.002376 -1.23238
C  1.356434 -0.172779 0.998345
C  -0.382773 -2.693856 1.427597
C  1.891666 -2.715494 -0.766509
C  -1.773154 -0.098607 -0.65981
C  -1.535056 1.29313 -0.487797
C  -3.032631 -0.617346 -0.253732
C  -2.523189 2.136738 0.067264
C  -4.022263 0.22438 0.302981
C  3.500794 0.505988 -0.023391
C  -3.772604 1.606768 0.46633
C  4.129248 1.452563 -1.024674
H  -1.14677 -1.87726 -1.742627
H  -0.094505 -0.462282 -1.986432
H  2.047895 -0.513462 1.791679
H  0.595215 0.499443 1.429284
H  0.304054 -3.003994 2.236416
H  -1.203888 -2.106792 1.877316
H  -0.819833 -3.609677 0.988357
H  1.472876 -3.663131 -1.152865
H  2.332143 -2.167339 -1.619332
H  2.709877 -2.955162 -0.064434
H  -0.568704 1.712008 -0.796057
H  -3.240295 -1.687134 -0.383608
H  -2.319671 3.207573 0.184112
H  -4.988763 -0.197169 0.60294
H  -4.540561 2.261065 0.893822
H  4.748425 2.191695 -0.485693
H  3.365281 1.980407 -1.613379
H  4.801791 0.888349 -1.692545
