program: Gaussian 09
title: 000262866
version: EM64L-G09RevD.01
frameworkgroup: C1[X(C9H20O2Si)]
method: RPBEPBE
basis: SDD
operation: Freq
keyword: #p
keyword: freq=noraman
keyword: PBEPBE/SDD
title: #p freq=noraman PBEPBE/SDD
converged: YES YES NO NO
title: Mulliken charges:
elementType: Si O O C C C C C C C C C H H H H H H H H H H H H H H H H H H H H
charge: 1.284035 -0.418223 -0.231239 -0.802961 -0.345251 -0.351150 -1.025137 -1.024204 -1.015990 -0.373476 -0.486324 0.171244 0.218046 0.218168 0.200468 0.200871 0.187211 0.187580 0.235111 0.234255 0.231227 0.234230 0.234840 0.231215 0.232439 0.231771 0.231648 0.214627 0.216306 0.251593 0.252105 0.374964
chargesum: 0.00000
title: Mulliken charges with hydrogens summed into heavy atoms:
elementType: Si O O C C C C C C C C C
charge: 1.284035 -0.043259 -0.231239 -0.366747 0.056088 0.023641 -0.324543 -0.323919 -0.320131 0.057457 0.017373 0.171244
polarizability: 1.59102313e+02 6.75575368e-01 1.20762706e+02 8.35243833e-02 -1.07613520e-02 1.06996918e+02
1716.lowfreq: -3.2440 -0.0019 -0.0017 -0.0004 5.3740 12.8398 21.9126 29.5003 45.5366
frequency: 16.6507 29.0979 45.5198 58.8574 64.9593 105.4108 107.7202 123.4763 127.2809 129.0414 135.1801 156.0436 184.2871 184.4676 219.8505 228.3767 251.8633 343.1421 383.2759 481.9174 499.7955 573.7106 590.9587 635.9530 668.9133 688.9498 694.9342 705.0608 726.9663 735.7466 771.1348 804.8142 825.7539 856.6249 887.7897 898.3240 920.2803 923.2084 996.5014 1025.8600 1033.4276 1046.5091 1075.9503 1089.4189 1118.6062 1187.3932 1217.8691 1233.6897 1267.1177 1267.7116 1288.2221 1288.5894 1291.5396 1301.5646 1303.4950 1318.2791 1347.8679 1371.1152 1434.6250 1437.3337 1443.2521 1445.8693 1447.0336 1455.9876 1457.4593 1460.9854 1464.8637 1471.6680 1484.9080 1669.4955 2952.5851 2955.1933 2964.4422 2976.5059 2976.8739 2978.3033 2986.2384 2990.4317 2995.7765 3007.5250 3027.3832 3034.6999 3062.0103 3078.2304 3078.6958 3079.7913 3081.0821 3081.4485 3081.8231 3512.2988
redmass: 7.6268 3.5751 4.2341 1.7790 2.6844 1.4266 1.9444 1.4101 1.4409 1.1305 1.6263 3.4547 2.2857 3.0698 3.1846 2.3270 3.3970 4.0797 4.1102 3.5616 1.7791 4.1471 4.3084 1.3247 1.6274 3.4153 1.8591 2.6419 1.1112 1.1668 1.2616 1.4428 1.3785 4.5846 1.3861 1.5135 1.5193 1.6363 4.9373 3.0249 1.2449 3.1524 2.3730 2.5271 1.3597 1.3359 1.4175 1.4048 1.4036 1.2600 1.0769 1.2056 1.1752 1.1073 1.1940 1.5106 1.5782 1.8448 1.0777 1.0844 1.0553 1.0542 1.0559 1.0498 1.0536 1.0485 1.0633 1.0894 1.0990 8.2334 1.0586 1.0589 1.0587 1.0342 1.0343 1.0342 1.0612 1.0978 1.0595 1.1009 1.1002 1.1020 1.1032 1.0983 1.0983 1.0987 1.0977 1.0978 1.0974 1.0639
irintensity: 0.9185 0.0196 0.2425 0.0253 0.0964 0.3660 0.6405 0.1257 0.0998 0.0434 0.0484 0.0537 0.0372 1.1184 2.0518 2.0865 6.8380 5.0467 1.6218 24.1388 29.7524 4.2805 14.8338 127.6403 0.3337 13.0545 13.1010 6.4860 14.2991 0.0267 0.3136 16.8941 20.9810 1.0437 41.5588 79.7860 36.1749 201.0790 39.7048 138.0700 20.9324 80.3351 15.8093 26.7283 0.1230 53.2381 1.3793 0.3415 7.3847 2.6174 4.4616 46.8144 43.2641 2.8635 17.0515 33.7166 8.3287 29.7595 2.1812 28.0929 0.2976 0.1263 0.4762 8.4214 11.4729 17.1973 1.3489 2.2435 18.1958 206.4815 4.8447 0.0684 70.1450 24.4074 20.4940 7.0747 5.3663 1.0285 38.8927 0.6593 19.9780 33.5900 75.1600 1.0326 1.2373 0.3274 37.6718 37.4752 54.6481 17.4406
temp: 298.150 k
press: 1.00000 atm
elementType: 14 8 8 6 6 6 6 6 6 6 6 6 1 1 1 1 1 1 1 1 1 1 1 1 1 1 1 1 1 1 1 1
symmnumber: 1
zpe: 714355.3 jmol-1
zpe.correction: 0.272084 hartree
zpe.thermalcorrener: 0.289926 hartree
zpe.thermalcorrenthalpy: 0.290870 hartree
zpe.thermalcorrgfe: 0.223668 hartree
zpe.sumelectzpe: -793.835433 hartree
zpe.sumelectthermal: -793.817591 hartree
zpe.sumelectthermalent: -793.816647 hartree
zpe.sumelectthermalfe: -793.883849 hartree
dipole: -0.3417 -1.5087 -0.0007
dipole: 1.5469
quadrupole: -80.3688 -89.6508 -82.6003
quadrupole: -5.0674 -0.0003 0.0368
quadrupole: 3.8378 -5.4442 1.6063 -5.0674 -0.0003 0.0368
hfenergy: -794.1075168 hartree
pointgroup: C01 [X(C9H20O2Si1)]
dipole: 0.137498 0.5917563 0.0364673 debye
polarizability: 159.0983089|0.4327565|120.7077151|0.7529147|0.8195782|107.0559126 unknown
InChI: InChI=1S/C9H20O2Si/c1-12(2,3)8-6-4-5-7-9(10)11/h10H,4-8H2,1-3H3
charge 0 multiplicity 1
32 atoms
Si 3.730596 -0.070653 0.038813
O  -5.498679 0.619176 -0.05415
O  -4.397125 -1.420157 -0.176372
C  2.050015 0.87406 0.050688
C  0.790039 -0.0276 0.008161
C  -0.533243 0.774375 0.010545
C  3.832937 -1.236919 1.557946
C  3.882862 -1.105527 -1.569022
C  5.162006 1.203209 0.117702
C  -1.784624 -0.130085 -0.031678
C  -3.090898 0.686339 -0.029496
C  -4.337045 -0.174159 -0.094499
H  2.036429 1.570671 -0.814254
H  2.017315 1.514558 0.957446
H  0.817703 -0.669386 -0.896856
H  0.792511 -0.717445 0.877465
H  -0.539932 1.462999 -0.86046
H  -0.564995 1.416823 0.915618
H  3.034725 -2.001905 1.535401
H  4.804042 -1.765746 1.582065
H  3.734139 -0.670013 2.502548
H  4.853438 -1.634452 -1.606072
H  3.082915 -1.866053 -1.63613
H  3.815298 -0.460804 -2.465223
H  6.144628 0.695692 0.127729
H  5.140933 1.881674 -0.755485
H  5.09249 1.823317 1.030906
H  -1.780247 -0.819154 0.834736
H  -1.755051 -0.772675 -0.932479
H  -3.121677 1.388081 -0.886708
H  -3.163957 1.322032 0.874777
H  -6.297547 0.026429 -0.103058
