program: Gaussian 09
title: 000262881
version: EM64L-G09RevD.01
frameworkgroup: C1[X(C11H22O4Si)]
method: RPBEPBE
basis: SDD
operation: Freq
keyword: #p
keyword: freq=noraman
keyword: PBEPBE/SDD
title: #p freq=noraman PBEPBE/SDD
converged: YES YES NO NO
title: Mulliken charges:
elementType: Si O O O O C C C C C C C C C C C H H H H H H H H H H H H H H H H H H H H H H
charge: 1.303516 -0.243887 -0.252139 -0.264111 -0.264389 -0.811979 -0.675880 -0.662859 -0.326253 -1.029774 -0.347320 -0.698317 0.310658 0.315439 -0.752765 -0.769216 0.258677 0.222029 0.273532 0.242439 0.242159 0.255917 0.180561 0.230705 0.244979 0.235318 0.243179 0.204414 0.184157 0.216951 0.214475 0.204162 0.249896 0.251075 0.245696 0.238022 0.295668 0.235266
chargesum: 0.00000
title: Mulliken charges with hydrogens summed into heavy atoms:
elementType: Si O O O O C C C C C C C C C C C
charge: 1.303516 -0.243887 -0.252139 -0.264111 -0.264389 -0.331274 -0.159909 -0.164783 0.085013 -0.306298 0.041251 -0.062729 0.310658 0.315439 -0.006098 -0.000260
polarizability: 1.57982830e+02 2.71069678e+00 1.46952845e+02 -2.39370935e+00 -4.16248798e+00 1.62314894e+02
1716.lowfreq: -14.1883 -10.4869 0.0002 0.0008 0.0009 2.5508 25.3649 30.7559 38.7547
frequency: 24.7379 30.5747 38.7286 42.6718 46.2770 54.8650 75.1151 83.6436 88.4139 100.0895 120.8011 135.5507 144.3466 147.8297 149.1829 160.6992 191.2070 198.0535 229.7988 269.5727 284.1274 288.1849 320.9737 329.6026 396.8143 430.5338 440.8797 556.3587 567.0113 599.0402 608.0868 614.3283 659.8055 675.3807 695.4007 730.9116 738.5705 763.7035 776.5637 807.5197 828.0199 864.7478 876.6968 890.9522 899.9639 945.2620 947.5235 1005.5300 1008.4476 1015.8020 1040.9885 1044.2218 1054.5258 1065.8589 1089.4585 1192.4133 1202.9963 1205.8470 1209.4317 1220.6795 1241.6966 1271.1257 1273.6362 1284.4809 1296.2157 1299.1407 1304.7757 1346.1224 1383.3531 1384.7375 1387.2942 1417.2404 1428.6484 1433.4416 1450.8568 1452.0784 1454.5566 1454.8488 1456.2987 1463.5541 1465.0296 1472.7908 1477.0169 1484.9634 1634.6070 1644.3586 2955.4084 2964.3991 2970.7751 2971.3816 2980.6033 3004.2820 3004.8427 3007.0483 3010.5417 3016.6450 3028.2223 3048.2341 3067.5181 3071.3320 3083.3588 3084.0962 3090.0893 3098.8572 3099.8000 3100.8199 3138.8691 3139.7304
redmass: 3.8649 1.1518 3.7356 1.6998 3.3353 3.9028 6.3670 5.1170 3.9520 3.3788 2.1888 1.2761 1.3929 1.8150 2.3457 4.0059 3.0869 2.3370 1.2121 3.5464 2.4631 2.7242 4.1460 4.4424 2.9750 3.4805 3.8327 3.3653 3.4268 3.6872 3.7800 4.3996 3.2339 2.0410 1.6558 2.9473 1.2188 2.7349 2.8401 1.7511 2.0045 1.6479 1.6949 1.7933 1.4281 5.9028 5.4364 1.9439 1.9542 3.7981 1.1813 1.6358 1.6122 2.6245 1.8696 2.5092 1.5637 2.5699 1.4027 1.2130 1.2371 1.2868 1.2327 1.3179 1.1873 1.2505 1.1464 1.4987 1.2291 1.2333 1.2148 1.0919 1.0894 1.0822 1.0535 1.0514 1.0560 1.0559 1.0558 1.0681 1.0578 1.0725 1.0446 1.0727 8.9323 8.8147 1.0605 1.0609 1.0566 1.0417 1.0343 1.0372 1.0387 1.0941 1.0563 1.0559 1.0996 1.1007 1.1000 1.1001 1.0986 1.0980 1.1042 1.0936 1.1055 1.0954 1.1021 1.1025
irintensity: 0.3039 0.3916 0.4653 0.2623 0.2808 1.5087 2.6653 3.8276 0.5559 2.6170 0.7101 0.9003 0.4447 4.2809 1.1626 6.3732 1.1203 1.1260 0.1461 12.7442 2.1526 7.1659 13.0542 11.6241 5.4961 1.0182 0.5806 2.4021 5.1077 4.6619 6.9048 12.9272 0.7698 4.0537 13.1544 4.0865 19.7497 12.8348 61.5512 13.2698 20.5492 32.0072 30.3028 18.6166 55.6707 12.9967 14.2154 8.3056 59.9912 7.8134 6.9031 12.6452 19.3385 7.5884 22.4555 46.8609 4.1148 276.6071 4.1470 43.9720 57.8261 18.3935 20.2950 68.9436 6.1731 11.9021 3.8735 0.8502 56.8771 54.7929 12.5753 23.5908 31.3828 1.3640 4.6763 7.9616 24.9979 7.3935 10.9164 1.1780 22.3557 5.4363 11.3674 12.8197 173.7282 162.6524 11.2270 31.8907 55.9436 24.6549 14.7180 11.3400 2.2632 5.5193 22.1458 19.2843 6.8723 19.1974 69.1720 62.9700 13.7399 13.7789 9.5427 10.2834 5.9329 4.6165 8.8351 7.8759
temp: 298.150 k
press: 1.00000 atm
elementType: 14 8 8 8 8 6 6 6 6 6 6 6 6 6 6 6 1 1 1 1 1 1 1 1 1 1 1 1 1 1 1 1 1 1 1 1 1 1
symmnumber: 1
zpe: 824376.8 jmol-1
zpe.correction: 0.313989 hartree
zpe.thermalcorrener: 0.336149 hartree
zpe.thermalcorrenthalpy: 0.337093 hartree
zpe.thermalcorrgfe: 0.259955 hartree
zpe.sumelectzpe: -1021.379746 hartree
zpe.sumelectthermal: -1021.357585 hartree
zpe.sumelectthermalent: -1021.356641 hartree
zpe.sumelectthermalfe: -1021.433780 hartree
dipole: 0.8343 -1.9737 1.5984
dipole: 2.6733
quadrupole: -106.3697 -103.1586 -99.9669
quadrupole: 0.8384 -3.3241 4.8314
quadrupole: -3.2047 0.0064 3.1982 0.8384 -3.3241 4.8314
hfenergy: -1021.6937342 hartree
pointgroup: C01 [X(C11H22O4Si1)]
dipole: 0.466343 0.8035207 -0.4929909 debye
polarizability: 156.4704306|-5.0848259|150.8029433|0.6366371|-6.7415972|159.9771945 unknown
InChI: InChI=1S/C11H22O4Si/c1-5-6-7-16(4,8-14-10(2)12)9-15-11(3)13/h5-9H2,1-4H3
charge 0 multiplicity 1
38 atoms
Si -0.216973 0.571631 -1.410905
O  2.176841 1.46914 -0.095343
O  0.258147 -2.226574 -1.219877
O  2.095775 -0.432266 1.250348
O  -1.302095 -2.331166 0.508788
C  -1.017648 1.028769 0.267445
C  1.721983 0.654695 -1.270323
C  -0.618935 -1.251941 -1.940631
C  -2.560209 0.871821 0.30185
C  -0.818614 1.733037 -2.809036
C  -3.170383 1.294511 1.659763
C  -4.705113 1.131387 1.701881
C  2.316022 0.795721 1.116119
C  -0.18607 -2.655568 0.039089
C  2.734801 1.74626 2.216485
C  0.86942 -3.494763 0.715664
H  -0.571313 0.388151 1.052376
H  -0.737234 2.076059 0.507058
H  2.131228 -0.368165 -1.178999
H  2.175085 1.167977 -2.134821
H  -0.389482 -1.420552 -3.006749
H  -1.679628 -1.499915 -1.748738
H  -3.029936 1.476155 -0.50314
H  -2.82172 -0.188138 0.113752
H  -0.566798 2.783476 -2.572538
H  -0.347137 1.480574 -3.776818
H  -1.914604 1.67185 -2.9399
H  -2.709163 0.684185 2.462018
H  -2.900423 2.35021 1.870384
H  -4.993667 0.078093 1.526216
H  -5.118001 1.4358 2.681413
H  -5.192666 1.748571 0.923131
H  3.259566 2.622415 1.807354
H  1.834905 2.098728 2.753714
H  3.373435 1.21593 2.939927
H  1.416614 -4.110592 -0.01537
H  1.589005 -2.806037 1.195476
H  0.406787 -4.128674 1.486633
