program: Gaussian 09
title: 000262852
version: EM64L-G09RevD.01
frameworkgroup: C1[X(C8H18O2Si)]
method: RPBEPBE
basis: SDD
operation: Freq
keyword: #p
keyword: freq=noraman
keyword: PBEPBE/SDD
title: #p freq=noraman PBEPBE/SDD
converged: YES YES NO NO
title: Mulliken charges:
elementType: Si O O C C C C C C C C H H H H H H H H H H H H H H H H H H
charge: 1.288742 -0.269148 -0.244969 -0.784647 -1.014716 -1.026392 -1.024569 -0.477068 0.255898 -0.262397 -0.664917 0.229613 0.250553 0.234091 0.235327 0.232411 0.235897 0.230572 0.236515 0.235566 0.233702 0.233843 0.241078 0.248160 0.233266 0.221832 0.216570 0.226161 0.249023
chargesum: 0.00000
title: Mulliken charges with hydrogens summed into heavy atoms:
elementType: Si O O C C C C C C C C
charge: 1.288742 -0.269148 -0.244969 -0.304480 -0.312886 -0.323409 -0.321457 0.012171 0.255898 0.192701 0.026836
polarizability: 1.45324255e+02 3.65309753e+00 1.09323111e+02 6.33370008e-03 3.50574664e-01 1.01524130e+02
1716.lowfreq: -8.4776 -6.3314 -0.0025 -0.0024 -0.0020 3.2606 17.7518 35.3883 47.7248
frequency: 12.8930 35.2773 47.7018 59.8241 78.9746 108.7265 115.5148 126.3552 134.3052 157.1379 173.3221 184.6367 205.1208 223.8925 234.6061 277.3372 308.3757 364.8106 453.3257 559.0976 572.8066 645.6250 668.2436 690.7532 696.1932 710.4741 736.3519 783.8238 803.8646 812.6180 822.2947 886.4322 889.4485 904.1946 924.5025 944.2776 1010.1415 1051.5579 1093.9324 1107.0225 1153.7571 1156.6402 1203.4462 1272.2568 1278.2810 1291.5661 1293.5865 1305.4638 1323.8456 1355.5682 1390.0773 1436.5664 1443.2689 1446.1551 1447.3002 1449.6080 1456.0593 1456.4156 1458.3154 1462.8677 1464.2746 1484.6431 1642.8305 2976.2979 2976.4952 2977.2423 2978.8084 2988.4832 2991.7085 3027.4544 3038.9011 3062.2004 3076.4829 3078.9713 3079.8767 3080.2466 3082.3672 3082.8939 3086.6729 3091.3039 3117.3790
redmass: 3.9102 3.0691 3.2146 2.4932 2.7745 1.0793 2.5025 1.0908 1.0529 2.7883 2.6808 2.3328 1.8940 1.9219 1.8418 3.6408 2.7220 3.4130 3.5111 2.9351 3.9301 3.7460 1.8511 3.2867 2.0737 2.5289 1.1682 1.6148 1.3473 1.3602 2.3179 2.0957 1.5009 1.9460 1.6490 1.7651 2.8718 4.0631 2.2547 2.1239 1.5719 1.5989 1.3681 1.1368 1.1178 1.2065 1.2016 1.1914 1.5213 1.3294 1.2320 1.0691 1.0552 1.0544 1.0570 1.0972 1.0898 1.0502 1.0505 1.0488 1.0432 1.0513 8.9235 1.0412 1.0503 1.0393 1.0362 1.0595 1.0360 1.0595 1.0963 1.0974 1.0980 1.0977 1.0985 1.0984 1.0979 1.0977 1.0974 1.1032 1.1059
irintensity: 0.8144 0.1036 0.6364 0.3536 0.8696 0.0853 3.0697 0.2106 0.1053 1.2719 0.8120 0.3677 3.8169 2.2759 2.3086 10.0505 15.4651 5.2564 1.2536 3.1815 5.3889 1.1681 1.3439 7.4538 14.4688 11.6722 0.0228 19.0255 23.9582 6.8036 11.2927 32.6903 43.6207 51.7592 191.5431 52.4687 21.8561 93.2141 83.1347 140.0748 90.7532 7.5748 104.8492 4.8160 3.4596 42.1129 46.8464 14.9929 36.5467 4.0324 23.1054 2.4812 0.1334 0.5597 1.4212 26.2654 8.7391 10.9145 9.3646 27.0918 13.9972 12.3897 141.3646 12.6498 10.4429 21.4955 6.0534 21.5766 20.2528 32.7284 2.4379 17.6070 4.0058 37.7585 3.7214 5.8125 32.3081 44.6404 36.7478 0.7041 34.7040
temp: 298.150 k
press: 1.00000 atm
elementType: 14 8 8 6 6 6 6 6 6 6 6 1 1 1 1 1 1 1 1 1 1 1 1 1 1 1 1 1 1
symmnumber: 1
zpe: 640494.8 jmol-1
zpe.correction: 0.243952 hartree
zpe.thermalcorrener: 0.260600 hartree
zpe.thermalcorrenthalpy: 0.261544 hartree
zpe.thermalcorrgfe: 0.197448 hartree
zpe.sumelectzpe: -754.607008 hartree
zpe.sumelectthermal: -754.590360 hartree
zpe.sumelectthermalent: -754.589415 hartree
zpe.sumelectthermalfe: -754.653511 hartree
dipole: -0.2510 -1.5159 0.1399
dipole: 1.5428
quadrupole: -66.1846 -82.6935 -75.7027
quadrupole: 3.1651 0.4601 0.0437
quadrupole: 8.6757 -7.8332 -0.8424 3.1651 0.4601 0.0437
hfenergy: -754.8509595 hartree
pointgroup: C01 [X(C8H18O2Si1)]
dipole: 0.0984952 -0.5440068 0.2506145 debye
polarizability: 145.3035417|-2.9134449|107.0524333|2.3726622|-3.572555|103.815521 unknown
InChI: InChI=1S/C8H18O2Si/c1-5-10-8(9)6-7-11(2,3)4/h5-7H2,1-4H3
charge 0 multiplicity 1
29 atoms
Si -2.785677 -0.143271 -0.03245
O  2.45432 -0.499691 0.759061
O  1.786616 1.312613 -0.552895
C  -1.027368 0.643657 0.007212
C  -4.07163 1.250009 -0.30394
C  -2.894462 -1.406758 -1.471385
C  -3.137971 -1.035168 1.628039
C  0.122852 -0.372016 0.19031
C  1.50217 0.26524 0.072014
C  3.87426 -0.035452 0.670718
C  4.547551 -0.583527 -0.590909
H  -0.991845 1.39319 0.822979
H  -0.863862 1.211564 -0.92935
H  -4.018777 2.005464 0.501949
H  -3.898415 1.767997 -1.265427
H  -5.099798 0.842975 -0.318754
H  -2.672414 -0.924444 -2.441574
H  -2.184447 -2.244273 -1.337064
H  -3.910383 -1.839342 -1.534707
H  -4.150523 -1.480047 1.62865
H  -2.414212 -1.850941 1.81217
H  -3.079053 -0.33033 2.478298
H  0.071083 -1.160185 -0.589566
H  0.064938 -0.896778 1.160766
H  3.883429 1.068797 0.68234
H  4.333846 -0.430858 1.590753
H  5.616492 -0.299712 -0.598027
H  4.482925 -1.684894 -0.625264
H  4.076058 -0.168021 -1.497344
