program: Gaussian 09
title: 000262850
version: EM64L-G09RevD.01
frameworkgroup: C1[X(C8H18OSi)]
method: RPBEPBE
basis: SDD
operation: Freq
keyword: #p
keyword: freq=noraman
keyword: PBEPBE/SDD
title: #p freq=noraman PBEPBE/SDD
converged: YES YES NO NO
title: Mulliken charges:
elementType: Si O C C C C C C C C H H H H H H H H H H H H H H H H H H
charge: 1.258735 -0.278574 -0.811078 -0.407658 0.098803 -0.654591 -1.019019 -1.027932 -0.392005 -0.701440 0.236909 0.221801 0.200864 0.212360 0.156483 0.198510 0.233940 0.233436 0.251107 0.230255 0.233035 0.235894 0.237943 0.209943 0.186866 0.246296 0.198716 0.210400
chargesum: 0.00000
title: Mulliken charges with hydrogens summed into heavy atoms:
elementType: Si O C C C C C C C C
charge: 1.258735 -0.278574 -0.352368 0.005566 0.255287 -0.222142 -0.304221 -0.321059 0.004803 -0.046027
polarizability: 1.33380056e+02 3.60913518e+00 1.03902557e+02 7.99950786e-01 7.46038499e-01 1.00737204e+02
1716.lowfreq: -16.7205 -8.7413 0.0019 0.0019 0.0025 13.7156 46.7797 84.5807 110.7526
frequency: 46.5800 84.5747 110.6804 121.7900 129.9996 134.6879 159.2331 183.0814 200.2876 221.1494 235.2947 271.2951 305.0639 366.1190 407.3016 450.2270 514.9272 569.3968 658.2018 684.7480 700.9268 715.4324 727.9186 770.1902 803.3889 823.1612 852.8333 894.2439 903.0895 923.2524 931.3903 967.6873 994.3839 1041.8777 1058.3971 1080.9359 1121.8813 1159.3107 1178.2581 1206.8601 1256.8450 1263.1286 1272.5584 1279.5125 1291.9372 1302.0867 1331.0372 1337.2035 1353.7174 1383.6644 1426.6468 1434.3339 1444.9417 1446.5728 1449.1656 1454.3761 1456.5037 1459.8091 1471.3759 1488.2566 2894.0964 2921.0475 2961.4871 2971.1103 2977.6336 2977.7233 2980.2847 2982.8504 3020.2163 3034.4597 3039.6465 3052.4613 3069.5122 3078.4084 3080.8907 3082.5547 3087.9454 3095.0352
redmass: 3.0020 1.9955 1.1937 1.0789 2.1350 2.7215 1.8904 2.4318 1.8231 1.8324 2.0322 2.2057 3.5169 3.7990 2.9972 2.5027 2.7008 3.2934 2.8664 3.4662 3.1001 1.4732 1.7500 1.3943 1.4586 1.5497 1.6871 1.6694 1.5299 1.6905 1.9546 2.6638 4.6491 1.4583 3.0105 1.6144 1.8191 1.3818 1.5827 1.2285 1.2639 1.2309 1.2239 1.2213 1.2028 1.1938 1.3912 1.2107 1.7236 1.2120 1.0768 1.0797 1.0743 1.0645 1.0557 1.0507 1.0674 1.0612 1.0432 1.0535 1.0831 1.0660 1.0593 1.0613 1.0360 1.0369 1.0342 1.0583 1.0994 1.0997 1.1001 1.0934 1.0993 1.0981 1.0982 1.0981 1.0981 1.0996
irintensity: 0.0363 0.0358 0.6892 0.1505 1.1561 1.3311 0.7619 0.6537 1.6993 1.5229 4.7776 0.9864 2.8396 6.7261 1.2312 1.9800 2.9769 4.9464 3.8283 9.1623 15.4161 2.7197 1.8420 21.2781 3.3662 32.7049 37.9154 71.5974 91.6515 54.1009 5.1399 4.5919 97.7565 3.6268 15.1105 7.3568 6.5293 6.9939 2.4114 11.8908 1.5945 0.2003 0.9795 3.1969 47.3210 21.3701 0.5217 13.2413 1.8133 19.1140 9.6087 5.4009 0.3476 4.1005 5.2681 7.6428 17.4951 6.9967 10.7630 11.9620 42.5053 64.7257 35.5948 21.8798 32.3381 42.1900 14.8965 35.5706 15.1385 14.5033 55.4011 21.0126 64.0565 7.3558 22.2003 26.4239 15.4164 35.1615
temp: 298.150 k
press: 1.00000 atm
elementType: 14 8 6 6 6 6 6 6 6 6 1 1 1 1 1 1 1 1 1 1 1 1 1 1 1 1 1 1
symmnumber: 1
zpe: 637735.8 jmol-1
zpe.correction: 0.242901 hartree
zpe.thermalcorrener: 0.256572 hartree
zpe.thermalcorrenthalpy: 0.257516 hartree
zpe.thermalcorrgfe: 0.203330 hartree
zpe.sumelectzpe: -679.432405 hartree
zpe.sumelectthermal: -679.418734 hartree
zpe.sumelectthermalent: -679.417790 hartree
zpe.sumelectthermalfe: -679.471976 hartree
dipole: -0.9266 0.8533 -1.0671
dipole: 1.6509
quadrupole: -71.0488 -70.6701 -71.6753
quadrupole: 2.7438 -1.3297 0.8333
quadrupole: 0.0826 0.4613 -0.5439 2.7438 -1.3297 0.8333
hfenergy: -679.6753059 hartree
pointgroup: C01 [X(C8H18O1Si1)]
dipole: -0.362122 0.352456 -0.4080337 debye
polarizability: 133.3244716|3.6959515|103.8630055|1.2800472|0.9254945|100.8323398 unknown
InChI: InChI=1S/C8H18OSi/c1-4-8-5-6-10(2,3)7-9-8/h8H,4-7H2,1-3H3
charge 0 multiplicity 1
28 atoms
Si -1.871561 -0.11881 -0.046099
O  0.782476 -0.915575 0.408621
C  -0.957883 1.4942 -0.558895
C  0.473903 1.548943 0.047009
C  1.32843 0.292926 -0.257375
C  -0.462846 -1.430224 -0.216851
C  -2.448584 -0.036207 1.775476
C  -3.337395 -0.50709 -1.216238
C  2.775023 0.42847 0.249511
C  3.680753 -0.744219 -0.178517
H  -1.537152 2.388047 -0.254993
H  -0.891686 1.52491 -1.666675
H  1.012064 2.43811 -0.340981
H  0.420161 1.663947 1.148419
H  1.33324 0.113785 -1.360567
H  -0.273921 -1.683741 -1.285443
H  -0.682112 -2.370942 0.319672
H  -3.017957 -0.942507 2.053505
H  -1.575986 0.035457 2.450133
H  -3.097747 0.840481 1.956359
H  -2.99954 -0.591873 -2.265754
H  -3.829523 -1.457703 -0.938689
H  -4.101643 0.291307 -1.171735
H  2.745105 0.497234 1.354796
H  3.188003 1.386945 -0.123514
H  3.255336 -1.699081 0.174386
H  3.771482 -0.795835 -1.280556
H  4.698357 -0.637657 0.239894
