program: Gaussian 09
title: 000262840
version: EM64L-G09RevD.01
frameworkgroup: C1[X(C7H16OSi)]
method: RPBEPBE
basis: SDD
operation: Freq
keyword: #p
keyword: freq=noraman
keyword: PBEPBE/SDD
title: #p freq=noraman PBEPBE/SDD
converged: YES YES NO NO
title: Mulliken charges:
elementType: Si O C C C C C C C H H H H H H H H H H H H H H H H
charge: 1.259499 -0.257443 -0.758904 -0.367811 -0.663017 -0.358649 -1.031163 -1.034402 -0.272730 0.231810 0.221214 0.200365 0.193868 0.203688 0.242159 0.186284 0.212526 0.233110 0.239956 0.234725 0.235595 0.236093 0.230800 0.172244 0.210181
chargesum: 0.00000
title: Mulliken charges with hydrogens summed into heavy atoms:
elementType: Si O C C C C C C C
charge: 1.259499 -0.257443 -0.305880 0.026423 -0.217170 0.040160 -0.323371 -0.331914 0.109696
polarizability: 1.14755816e+02 -2.96749406e+00 9.56771861e+01 1.20007577e+00 1.02035352e-01 9.20903457e+01
1716.lowfreq: -25.0311 -13.5477 -3.8604 -0.0019 -0.0006 0.0002 5.0514 99.8869 106.7651
frequency: -18.3913 99.7223 106.7487 131.5838 151.2849 166.1394 181.9150 199.2452 259.6205 275.3946 304.1307 363.6525 423.5470 454.8771 559.0663 654.0895 666.1711 686.6376 727.1869 742.3539 753.6245 799.8767 844.3390 854.0651 888.8534 890.8593 897.5171 926.2934 978.2372 1034.2887 1059.0887 1109.4077 1143.3697 1180.5717 1217.3313 1252.4607 1269.9851 1281.7315 1286.3873 1289.3538 1299.0771 1340.6591 1354.8855 1362.9352 1425.4370 1432.0044 1443.8167 1444.5005 1446.8092 1453.0693 1455.4930 1458.2768 1476.6818 2919.0814 2935.7442 2952.1144 2965.2168 2966.6568 2975.7438 2977.4452 3005.3570 3025.2500 3029.3976 3035.6899 3040.9613 3076.6908 3078.8531 3080.7181 3082.2098
redmass: 2.5311 1.0237 2.5825 1.0621 2.7632 2.5579 2.5470 2.5356 3.0183 2.9272 2.0311 2.9948 2.7821 1.6174 3.4878 3.0852 3.6388 3.3004 1.3977 1.4682 2.7823 1.4025 2.3048 1.4571 2.0092 1.5739 1.5724 2.1343 3.0386 1.6903 2.5423 2.4673 1.2862 1.2509 1.2323 1.2196 1.1924 1.2154 1.1903 1.1993 1.1945 1.3613 1.4208 1.2558 1.0817 1.0710 1.0557 1.0734 1.0666 1.0525 1.0569 1.0769 1.0815 1.0660 1.0640 1.0599 1.0607 1.0644 1.0343 1.0342 1.0980 1.0983 1.0981 1.0992 1.0936 1.0980 1.0983 1.0978 1.0983
irintensity: 0.9271 0.0133 1.6453 0.1649 2.8436 0.9191 0.9402 1.1954 3.9190 3.2271 0.2857 3.7975 7.7829 4.7933 6.8511 2.1745 10.3741 13.3663 5.1034 14.6315 6.6036 20.1438 39.8754 21.8783 38.7128 70.0327 52.2547 40.4216 6.4638 39.1736 41.4905 1.2989 2.0763 25.7842 3.4207 3.4357 0.8941 2.3883 21.4157 34.0954 15.3863 0.1692 4.9583 5.8658 5.0409 10.2812 0.3610 5.8407 10.3073 8.5707 18.9113 2.5485 9.9294 54.2162 61.3095 22.9609 47.0092 25.0377 19.5739 16.2362 55.3665 44.4485 34.1061 61.1053 30.7613 16.8704 5.9070 36.4683 20.0387
temp: 298.150 k
press: 1.00000 atm
elementType: 14 8 6 6 6 6 6 6 6 1 1 1 1 1 1 1 1 1 1 1 1 1 1 1 1
symmnumber: 1
zpe: 566143.4 jmol-1
zpe.correction: 0.215633 hartree
zpe.thermalcorrener: 0.226853 hartree
zpe.thermalcorrenthalpy: 0.227798 hartree
zpe.thermalcorrgfe: 0.179592 hartree
zpe.sumelectzpe: -640.198541 hartree
zpe.sumelectthermal: -640.187321 hartree
zpe.sumelectthermalent: -640.186376 hartree
zpe.sumelectthermalfe: -640.234582 hartree
dipole: -0.4142 -1.2145 1.0834
dipole: 1.6794
quadrupole: -62.8875 -67.0325 -65.2294
quadrupole: -3.1273 1.9094 2.3356
quadrupole: 2.1623 -1.9827 -0.1796 -3.1273 1.9094 2.3356
hfenergy: -640.414174 hartree
pointgroup: C01 [X(C7H16O1Si1)]
dipole: 0.2171268 0.4846081 0.393139 debye
dipolederiv: 1.261084 -0.0537636 -0.0127811 -0.0400492 1.0149568 0.0351813 -0.0060755 0.0378062 1.1262175 -0.9794456 0.0935352 0.0192749 0.1520638 -0.5440493 0.024305 0.1262312 -0.0303408 -0.3621887 -0.3441662 0.0590729 0.032167 0.0376694 -0.2031971 0.0085296 0.0652019 -0.0144189 -0.2202666 0.1148579 -0.0418967 0.0277028 0.0191428 0.0668753 -0.0101242 -0.08661 0.0612495 0.1501537 0.3905825 0.0108678 0.0130068 0.0357247 0.0066081 -0.0566346 0.0949916 -0.0722718 0.0206872 0.0599422 0.0062386 0.0047092 0.0438394 -0.0279264 0.0375442 0.0082075 0.0766987 0.0783213 -0.4312398 0.0405331 0.1002125 0.0226111 -0.2724662 -0.0308471 0.083967 -0.029495 -0.3398232 -0.3475075 -0.0123547 -0.0561114 -0.0339265 -0.2829148 -0.0467627 -0.0788853 -0.0585303 -0.438166 0.545283 -0.1116759 -0.0710965 -0.3001995 0.4403287 0.0141579 -0.2213122 0.0079678 0.3371375 0.0234805 -0.0025727 -0.1000431 0.0251277 0.076858 -0.0418866 -0.0413546 -0.0481843 -0.1209697 -0.0240304 -0.0792044 0.0424549 -0.1281684 -0.1069496 0.0558094 0.0564931 0.0368492 0.070727 -0.0574285 0.1059656 -0.0032676 0.106823 -0.1797632 0.0661817 -0.0084859 0.0862383 0.0458754 0.0184786 -0.0455542 -0.0476933 -0.0284363 0.0687017 -0.0230237 -0.035468 -0.0788106 -0.170765 -0.0293821 -0.0078555 0.0264967 -0.0198102 0.0093343 0.1050575 -0.0601167 0.1490364 -0.1829265 -0.0036311 0.0533165 0.0230621 0.0771113 -0.0830133 -0.0999692 0.0385931 -0.1034639 0.0377696 -0.1524757 0.0704781 0.0976157 0.1035839 -0.0064812 -0.0359078 0.1396299 -0.0446358 0.0283337 0.0640215 -0.0298261 -0.0343866 -0.0445361 0.0341696 -0.0264332 -0.1006572 -0.0094102 -0.13121 -0.0257378 0.1254154 -0.0455229 0.1304798 -0.0248341 0.0484837 -0.0395328 0.0455741 0.0805652 0.1006451 -0.017468 -0.0432126 -0.0171523 0.0725946 -0.0784485 -0.0505271 -0.0755348 -0.1143028 -0.0141235 -0.1255812 0.0425426 -0.1235709 -0.0376332 0.0448452 0.0564582 0.0484952 0.086409 -0.0077274 0.0972494 -0.0810752 0.1020055 0.0127073 0.0753839 -0.0904483 0.0838386 0.0400021 0.0251329 -0.1162363 -0.0016301 -0.1323373 -0.0846262 -0.0062587 -0.0157483 -0.0126552 0.1056902 0.0006018 0.0293524 0.1301996 0.040285 0.0829766 -0.0400271 0.1546936 -0.0381146 -0.0315604 0.0043849 0.0324702 -0.1360007 0.0559238 0.0062152 -0.0474104 -0.037254 -0.0272646 -0.1677636 -0.1915995 -0.0805059 0.0733763 -0.0842045 -0.0384718 0.0282544 0.048009 0.0093768 0.0720531 unknown
polarizability: 114.1196827|-3.9989817|96.0325864|-2.6632639|0.1019697|92.3710791 unknown
InChI: InChI=1S/C7H16OSi/c1-9(2)6-4-3-5-8-7-9/h3-7H2,1-2H3
charge 0 multiplicity 1
25 atoms
Si 1.277065 -0.034729 -0.077524
O  -1.180997 -1.56656 -0.217851
C  0.152888 1.310975 -0.863257
C  -1.096915 1.725464 -0.037568
C  0.234736 -1.657933 0.19485
C  -2.261491 0.706249 -0.064146
C  2.743579 -0.414361 -1.253648
C  1.957212 0.568818 1.613095
C  -2.004813 -0.660521 0.603049
H  -0.16856 0.959192 -1.864615
H  0.790991 2.202815 -1.036879
H  -1.482812 2.687636 -0.432453
H  -0.80963 1.925918 1.016637
H  0.299147 -1.98948 1.256635
H  0.645827 -2.47409 -0.428304
H  -3.138174 1.162507 0.443341
H  -2.566276 0.516367 -1.112437
H  3.402283 -1.196433 -0.831972
H  2.377667 -0.771545 -2.234165
H  3.360629 0.486535 -1.428623
H  2.638505 -0.182704 2.054382
H  2.524131 1.511781 1.501807
H  1.140964 0.748428 2.337429
H  -1.55081 -0.530741 1.610986
H  -2.969043 -1.188588 0.72933
