program: Gaussian 09
title: 000262839
version: EM64L-G09RevD.01
frameworkgroup: C1[X(C7H16Cl2Si)]
method: RPBEPBE
basis: SDD
operation: Freq
keyword: #p
keyword: freq=noraman
keyword: PBEPBE/SDD
title: #p freq=noraman PBEPBE/SDD
converged: YES YES NO NO
title: Mulliken charges:
elementType: Cl Cl Si C C C C C C C H H H H H H H H H H H H H H H H
charge: -0.088310 -0.085733 1.310603 -0.790923 -0.322249 -0.880220 -0.867878 -1.007212 -0.343211 -0.693706 0.241070 0.222074 0.211074 0.191456 0.296112 0.276752 0.291404 0.274023 0.237113 0.258738 0.240010 0.197991 0.192483 0.207581 0.218636 0.212323
chargesum: 0.00000
title: Mulliken charges with hydrogens summed into heavy atoms:
elementType: Cl Cl Si C C C C C C C
charge: -0.088310 -0.085733 1.310603 -0.327779 0.080280 -0.307356 -0.302450 -0.271351 0.047263 -0.055166
polarizability: 1.40967072e+02 2.93311544e+00 1.11039299e+02 -4.89818574e+00 -6.57385616e+00 1.00592683e+02
1716.lowfreq: -12.2497 -5.3401 -0.0012 0.0032 0.0034 6.7413 26.1987 42.9448 44.9338
frequency: 24.7568 42.9137 44.5354 54.6711 87.9435 105.7246 118.0868 123.8736 136.5978 182.4230 192.5412 198.7412 220.3369 233.1129 277.9498 345.8611 393.0989 568.8063 597.1233 636.4117 678.5856 693.7280 708.1512 728.0500 746.5954 770.7663 798.4267 855.0077 867.3948 891.1153 899.0214 1015.4579 1037.2677 1065.6856 1081.0520 1090.4773 1094.9568 1183.7577 1190.1899 1205.0442 1209.9380 1271.6821 1294.3855 1298.3582 1304.9250 1341.8708 1389.3350 1412.0055 1413.1434 1433.6621 1447.2969 1454.7443 1464.2135 1473.4951 1478.2048 1485.4771 2955.4852 2967.7228 2972.5527 2972.9921 2986.4028 2999.2575 3022.8179 3041.2701 3042.3226 3044.0439 3069.0044 3073.0501 3087.4182 3096.4927 3126.7204 3128.0365
redmass: 3.3440 12.2152 1.9510 4.6381 2.7671 2.4428 1.1133 2.8003 3.4676 2.6992 2.4327 3.8974 3.1846 1.1580 3.9411 3.8096 3.0196 4.8046 7.1337 4.6493 1.3089 2.5175 3.1137 1.3577 1.7027 1.7594 1.9760 1.4440 1.5622 1.7549 1.3854 4.0664 1.1475 2.6041 1.1356 1.4694 1.1205 1.1840 1.2077 1.4628 1.3572 1.1959 1.0799 1.3219 1.1858 1.5045 1.2126 1.0779 1.0782 1.0758 1.0501 1.0519 1.0663 1.0740 1.0425 1.0730 1.0590 1.0590 1.0418 1.0542 1.0344 1.0968 1.1014 1.1017 1.0561 1.0557 1.1007 1.0994 1.0982 1.0984 1.1081 1.1079
irintensity: 0.2948 1.6589 0.3470 1.1186 2.1884 1.0760 0.3540 1.2664 3.2421 1.1179 0.1030 2.1416 2.6357 0.1179 7.5836 13.3105 2.3768 3.8052 22.1361 12.0657 6.2479 3.6980 1.0291 14.0167 3.8950 18.4691 34.1217 53.8623 37.3556 24.1901 55.9875 11.3736 6.5314 11.2039 1.7859 27.1584 14.6301 6.4464 3.5463 3.1805 11.5269 1.8102 1.1811 2.3403 34.3532 0.4922 12.0772 14.9900 13.1891 8.5961 7.2114 11.1030 0.7846 3.6904 13.1641 14.1585 5.5091 10.8236 68.0104 34.1918 10.7710 2.1960 4.0898 35.2408 11.1372 9.7233 78.4919 52.6179 13.5407 8.7166 3.6897 4.2179
temp: 298.150 k
press: 1.00000 atm
elementType: 17 17 14 6 6 6 6 6 6 6 1 1 1 1 1 1 1 1 1 1 1 1 1 1 1 1
symmnumber: 1
zpe: 561913.3 jmol-1
zpe.correction: 0.214021 hartree
zpe.thermalcorrener: 0.229482 hartree
zpe.thermalcorrenthalpy: 0.230426 hartree
zpe.thermalcorrgfe: 0.168693 hartree
zpe.sumelectzpe: -1485.035639 hartree
zpe.sumelectthermal: -1485.020179 hartree
zpe.sumelectthermalent: -1485.019234 hartree
zpe.sumelectthermalfe: -1485.080968 hartree
dipole: 2.2886 -2.0987 0.2616
dipole: 3.1162
quadrupole: -93.7824 -89.4247 -80.4693
quadrupole: -0.8250 -0.5143 1.1662
quadrupole: -5.8902 -1.5326 7.4228 -0.8250 -0.5143 1.1662
hfenergy: -1485.2496607 hartree
pointgroup: C01 [X(C7H16Cl2Si1)]
dipole: -0.941517 0.776562 0.116643 debye
dipolederiv: -0.204295 -0.0218759 -0.0121145 -0.0210089 -0.5710719 -0.120926 -0.0112948 -0.1196702 -0.2360045 -0.695615 -0.0379207 -0.0495006 -0.0327491 -0.1831648 -0.0000348 -0.0717328 -0.000681 -0.2079307 1.3593425 -0.0052275 -0.0103843 0.0155234 1.2275432 0.0503438 -0.11234 -0.1241812 0.9908453 -0.4586564 -0.030014 0.0109933 -0.0637768 -0.1668089 -0.0038314 0.1796019 0.008557 -0.2180917 0.0037122 -0.0153401 0.0209128 0.0350192 0.1514018 0.0302359 -0.2528263 0.0166818 0.0762693 -0.1878014 0.0552705 0.0041094 0.0406245 0.1726465 0.2038104 0.0133201 0.2417963 -0.0458884 0.2681736 0.0278366 0.1572725 0.0336484 -0.157276 -0.0229534 0.1744406 0.0116644 -0.1019034 -0.3489194 -0.0107742 -0.0216672 -0.0164044 -0.4255918 -0.097415 -0.0265558 -0.0133354 -0.326915 0.0155837 -0.0169629 0.0073435 -0.0425583 0.1644504 0.0093956 0.1178593 0.0134741 0.10518 -0.103662 -0.0269532 0.0448521 -0.015221 0.0884308 0.0189319 -0.0147006 0.0169071 0.0467991 0.0800904 -0.0437982 -0.0233348 -0.0103855 0.0042645 -0.1178257 0.0360848 -0.092496 -0.0473637 0.0506784 0.0782457 -0.0321808 0.0180756 -0.0823137 0.1067343 0.0135888 0.1099132 0.0219992 0.0530896 0.0101599 -0.010598 0.0076534 -0.1087477 0.1009417 -0.0128347 0.0845963 0.0032789 0.0393227 -0.0015739 0.0044882 0.0046709 -0.02737 -0.1257426 0.0066688 -0.108414 -0.0943737 -0.0207059 0.0402263 -0.0879881 0.0584532 0.0162177 -0.0408671 -0.0882489 -0.0406904 0.0526642 0.0498401 -0.0488056 0.0980061 -0.0698512 -0.0013867 -0.0231414 0.1089486 -0.029703 -0.0370514 0.0019971 0.0303129 -0.0285991 0.029564 0.0236436 -0.099726 -0.0245752 -0.1006956 0.0191511 -0.0031896 -0.0331992 -0.0366555 -0.0210529 -0.0014587 0.1019085 -0.033698 0.1094495 0.0020409 0.0111074 0.0146142 0.1260223 0.0326985 0.1092604 -0.0076124 0.1459893 0.0034339 -0.0188791 -0.0437693 -0.0271915 -0.1057196 -0.0451422 0.116747 -0.009428 -0.1119465 -0.0052447 0.0632887 0.1076334 0.0239212 -0.008367 0.0256174 -0.1218254 0.0783995 -0.0064959 0.048106 0.0607166 0.0295548 0.022054 0.0437556 0.0011984 -0.0211015 -0.1346937 0.00672 -0.1082377 -0.0965253 0.0260108 -0.0112635 0.0073874 0.0239511 -0.1428927 0.1274447 -0.0136384 0.0970876 0.0108653 0.0849102 -0.0181767 0.0012863 0.0209415 -0.0287362 -0.140269 0.0624182 -0.117025 -0.078162 -0.1995796 -0.0039771 -0.0908373 -0.0007411 0.0990581 0.0098612 -0.1161473 0.0075893 0.0203114 0.0851468 0.050413 -0.0084829 -0.0087479 -0.133918 0.106459 0.0313947 0.0911177 0.0356787 unknown
polarizability: 140.634361|4.4683204|111.2828693|4.3557561|6.904492|100.6818231 unknown
InChI: InChI=1S/C7H16Cl2Si/c1-3-4-5-10(2,6-8)7-9/h3-7H2,1-2H3
charge 0 multiplicity 1
26 atoms
Cl 0.870077 -2.696817 0.006242
Cl 4.017533 0.586107 -0.258417
Si 0.911808 0.428718 0.143011
C  -0.763636 0.41272 -0.791212
C  -1.991744 0.118987 0.110784
C  1.131458 -1.195632 1.147993
C  2.336829 0.480643 -1.1468
C  1.056302 1.903914 1.345948
C  -3.329805 0.168353 -0.665417
C  -4.55053 -0.154052 0.222982
H  -0.710289 -0.347449 -1.596422
H  -0.894423 1.393994 -1.293465
H  -1.883377 -0.884958 0.5694
H  -2.037044 0.847822 0.947232
H  2.15221 -1.305824 1.547694
H  0.3974 -1.314039 1.960945
H  2.383823 -0.439456 -1.751228
H  2.299545 1.361016 -1.808472
H  0.286556 1.856474 2.137656
H  2.05014 1.915955 1.827367
H  0.930102 2.860494 0.806197
H  -3.28228 -0.54975 -1.508981
H  -3.450447 1.174034 -1.117384
H  -4.633865 0.563228 1.061567
H  -5.492517 -0.108967 -0.353686
H  -4.468224 -1.168714 0.656066
