program: Gaussian 09
title: 000262825
version: EM64L-G09RevD.01
frameworkgroup: C1[X(C5H14OSi)]
method: RPBEPBE
basis: SDD
operation: Freq
keyword: #p
keyword: freq=noraman
keyword: PBEPBE/SDD
title: #p freq=noraman PBEPBE/SDD
converged: YES YES NO NO
title: Mulliken charges:
elementType: Si O C C C C C H H H H H H H H H H H H H H
charge: 1.317993 -0.478213 -0.719533 -0.664335 -1.025190 -1.037754 -0.682093 0.214882 0.244852 0.207580 0.207859 0.227959 0.227142 0.257978 0.237441 0.233853 0.232549 0.219168 0.222924 0.210843 0.344095
chargesum: 0.00000
title: Mulliken charges with hydrogens summed into heavy atoms:
elementType: Si O C C C C C
charge: 1.317993 -0.134118 -0.259799 -0.248896 -0.312111 -0.333911 -0.029157
polarizability: 8.42806700e+01 -1.29997285e-01 8.40156758e+01 -7.89563357e-01 -3.08723899e-01 7.83463723e+01
1716.lowfreq: -21.4085 0.0007 0.0012 0.0023 3.1195 10.0688 38.9075 69.3138 114.6916
frequency: 38.4317 69.1374 114.5439 119.9238 132.7393 145.9943 176.4045 189.8568 204.6255 235.4683 274.3827 329.6325 331.7202 554.6325 658.6800 668.1322 690.6612 710.5514 774.1667 811.6807 839.1955 897.1581 910.5838 935.7542 990.6526 994.3271 1028.6447 1161.8574 1170.1996 1240.6761 1249.4488 1293.3266 1299.3817 1319.9379 1389.0590 1437.1213 1445.6186 1448.8674 1453.3042 1456.2273 1460.6391 1483.8444 1488.3537 2926.6119 2969.2068 2976.4789 2978.0787 2979.6833 2982.0419 3033.9330 3057.9086 3069.2542 3078.9988 3079.9941 3083.2848 3091.8475 3545.3300
redmass: 2.8279 2.4098 1.1965 2.2007 1.0349 2.4583 1.8482 2.1290 2.0583 1.4442 1.2124 3.2362 3.4897 3.3812 2.8298 2.6987 1.8321 1.9083 1.2984 1.3346 1.5327 1.4248 1.5837 7.0178 1.3773 1.4015 2.6644 1.0445 1.0804 1.2579 1.3747 1.2033 1.2110 1.3724 1.1875 1.0759 1.0605 1.0536 1.0633 1.0525 1.0506 1.0482 1.0419 1.0531 1.0354 1.0580 1.0361 1.1028 1.0352 1.0986 1.0994 1.1001 1.0981 1.0978 1.0979 1.0985 1.0669
irintensity: 0.5863 3.2826 0.5370 0.9606 0.0837 0.8652 8.6223 1.1728 6.6218 0.5966 124.5235 24.9721 21.2135 3.6085 4.9777 9.2788 14.1633 20.7729 24.4880 25.5257 56.2434 79.7451 119.1324 41.2961 14.2218 7.9628 18.8726 19.5293 4.4933 3.4191 5.6970 44.9290 29.6246 4.0852 8.0799 5.1854 4.5770 1.4135 12.2663 3.5102 19.7069 6.2244 11.9157 54.7229 46.3484 19.2535 14.9124 54.2693 22.5354 1.7992 49.6494 50.6032 15.9492 14.4368 34.3819 13.5070 0.3669
temp: 298.150 k
press: 1.00000 atm
elementType: 14 8 6 6 6 6 6 1 1 1 1 1 1 1 1 1 1 1 1 1 1
symmnumber: 1
zpe: 469403.9 jmol-1
zpe.correction: 0.178786 hartree
zpe.thermalcorrener: 0.190772 hartree
zpe.thermalcorrenthalpy: 0.191716 hartree
zpe.thermalcorrgfe: 0.141112 hartree
zpe.sumelectzpe: -562.936436 hartree
zpe.sumelectthermal: -562.924450 hartree
zpe.sumelectthermalent: -562.923506 hartree
zpe.sumelectthermalfe: -562.974110 hartree
dipole: -0.2637 -0.1336 -1.5043
dipole: 1.5331
quadrupole: -52.2179 -50.8498 -52.7465
quadrupole: 2.2135 3.1727 3.4823
quadrupole: -0.2798 1.0883 -0.8085 2.2135 3.1727 3.4823
hfenergy: -563.115222 hartree
pointgroup: C01 [X(C5H14O1Si1)]
dipole: 0.1406993 0.0418342 -0.5850286 debye
dipolederiv: 1.258607 -0.0361093 0.0388365 -0.0234805 1.2539238 -0.0019251 0.0144036 0.0393795 1.194546 -0.5476596 -0.0326194 -0.2404194 -0.0191301 -0.6259852 -0.2317056 -0.2057998 -0.177012 -0.3204881 -0.254072 0.0697095 -0.0117597 0.0730028 -0.2497271 -0.008849 -0.0477958 0.0277694 -0.2617254 0.0857823 0.0777204 0.1774892 0.065538 0.1653026 0.2048093 0.149516 0.145525 0.0012106 -0.3667006 0.0570763 -0.0942904 0.0642164 -0.3555845 0.0545097 -0.0626622 0.0542824 -0.3665577 -0.3337504 -0.0372301 -0.055097 -0.0473102 -0.3716046 -0.0744677 -0.0444248 -0.0928467 -0.3771468 0.0243147 0.0615892 -0.0468276 0.0429763 0.0396875 0.0569409 0.0727032 -0.0473507 0.0572424 -0.0491863 -0.0852704 0.0994763 -0.0484292 -0.0057363 0.0980991 0.0723794 0.1150078 -0.0061531 0.0656238 -0.0055751 -0.0689002 -0.0334497 -0.0131938 -0.1065354 -0.0936953 -0.0780375 -0.0466632 -0.1381248 0.0844922 0.1077547 0.0398876 -0.0138931 -0.1062556 0.0703236 -0.1254742 -0.0389652 0.023239 0.0184216 -0.1184649 0.0527276 -0.0822309 0.1064795 -0.1431809 0.0563008 -0.1192948 0.0487003 -0.0710248 0.0791172 -0.0842724 0.0039015 0.1052388 0.09071 0.1057415 -0.0042645 -0.0318506 0.1292559 0.0673342 0.1275101 -0.0184032 -0.0564456 0.051807 -0.0512478 0.0679747 0.0313971 -0.0686847 -0.0887549 -0.0576601 0.074403 -0.0766881 -0.0910114 -0.0918857 0.0056498 -0.002751 -0.1225144 0.0543426 -0.119305 -0.0275243 0.0614728 0.0395712 0.052449 0.0832863 0.0113182 0.0619351 -0.1127266 0.0520674 0.0717609 0.0789082 -0.1154802 0.0934054 -0.0324238 0.0126648 0.0906352 0.0904826 0.1002593 0.0110141 -0.0878787 0.1000064 -0.0928298 0.0140783 -0.1013143 0.157661 0.0692755 0.1573956 -0.025009 -0.0474402 0.0877508 -0.0611873 0.021563 0.0159199 -0.1203983 0.0699627 -0.0782468 -0.027444 0.092843 0.045161 0.1050308 0.0113221 0.0325877 -0.0519144 -0.0908225 -0.0908777 0.0069331 -0.1015563 -0.1169915 -0.0690291 -0.0528033 0.2152547 -0.1771554 0.0739919 -0.1734193 0.1894094 0.040446 0.1267096 0.0920094 0.1696126 unknown
polarizability: 84.1230903|-0.2011326|84.0716537|1.1109439|0.2441205|78.4479742 unknown
InChI: InChI=1S/C5H14OSi/c1-4-7(2,3)5-6/h6H,4-5H2,1-3H3
charge 0 multiplicity 1
21 atoms
Si 0.040019 -0.595143 0.003066
O  1.792021 1.508692 0.110821
C  -1.300104 0.435448 0.915623
C  1.225318 0.612456 -0.925352
C  1.068877 -1.611079 1.252935
C  -0.756639 -1.740791 -1.313352
C  -2.165068 1.326438 -0.012209
H  -1.949374 -0.257985 1.488602
H  -0.781072 1.06887 1.661729
H  2.024208 0.039319 -1.44637
H  0.665745 1.186444 -1.696713
H  0.422324 -2.231762 1.900564
H  1.778971 -2.283321 0.736718
H  1.651921 -0.927374 1.896011
H  -1.428543 -2.479302 -0.837466
H  -1.354109 -1.166454 -2.045874
H  0.015127 -2.302154 -1.872569
H  -2.927394 1.88578 0.562292
H  -1.542013 2.070413 -0.542897
H  -2.69898 0.727248 -0.773972
H  2.423565 2.14666 -0.308187
