program: Gaussian 09
title: 000262824
version: EM64L-G09RevD.01
frameworkgroup: C1[X(C5H13ClSi)]
method: RPBEPBE
basis: SDD
operation: Freq
keyword: #p
keyword: freq=noraman
keyword: PBEPBE/SDD
title: #p freq=noraman PBEPBE/SDD
converged: YES YES NO NO
title: Mulliken charges:
elementType: Cl Si C C C C C H H H H H H H H H H H H H
charge: -0.093807 1.296926 -0.722965 -0.877656 -1.008977 -1.020914 -0.669557 0.224308 0.228451 0.271186 0.275162 0.254314 0.232776 0.232259 0.232680 0.256080 0.234502 0.224039 0.219700 0.211494
chargesum: 0.00000
title: Mulliken charges with hydrogens summed into heavy atoms:
elementType: Cl Si C C C C C
charge: -0.093807 1.296926 -0.270206 -0.331309 -0.289628 -0.297652 -0.014323
polarizability: 1.00847151e+02 -3.82561789e+00 8.07470678e+01 -3.32239494e+00 -6.12124102e-02 7.81154097e+01
1716.lowfreq: -15.8578 -6.6760 -0.0027 -0.0015 -0.0013 13.8553 43.7062 55.7347 105.1294
frequency: 43.4452 55.6438 105.1153 112.1755 122.6019 140.7092 163.9851 194.6123 198.5974 240.7554 261.6100 334.6922 546.4455 603.3176 663.7841 683.5663 689.3999 717.6249 736.6288 812.4448 853.3099 877.8373 906.0154 984.2612 992.5661 1026.3718 1082.0723 1181.4139 1236.0903 1245.8034 1295.1726 1304.0732 1392.3722 1414.2399 1438.7486 1444.9764 1448.9158 1454.1515 1458.9509 1482.7210 1486.9497 2970.0564 2973.3975 2983.1958 2984.0775 3023.1877 3034.3846 3062.3994 3070.0373 3084.6266 3085.5277 3090.9660 3092.8792 3116.8608
redmass: 2.2809 3.4475 2.7096 1.0636 1.0221 3.2057 1.8374 2.3510 1.9708 1.5694 3.7360 3.4610 3.9447 4.5328 3.2160 2.0734 1.7555 1.5834 2.3860 1.3034 1.5958 1.3862 1.4746 1.2957 1.4886 2.6065 1.0413 1.1755 1.2301 1.4198 1.2022 1.1920 1.1884 1.0803 1.0720 1.0574 1.0543 1.0486 1.0494 1.0463 1.0427 1.0525 1.0415 1.0343 1.0343 1.0994 1.0559 1.0997 1.0998 1.0984 1.0979 1.0985 1.0980 1.1079
irintensity: 0.2775 2.0197 1.4934 0.1579 0.0137 0.3966 0.1584 0.8133 0.5249 1.2435 8.1529 4.0912 0.1675 23.6719 5.5380 6.8795 4.3185 8.2634 19.3362 19.0050 63.9537 98.8663 81.4977 32.2591 3.2425 16.7317 5.4464 3.5246 3.9857 3.7875 49.3339 26.9212 8.5478 9.3603 3.7131 3.2911 5.0800 11.4824 15.8441 9.8243 10.2032 37.4548 26.0182 19.6164 7.0560 6.2875 14.5710 46.1016 50.5303 10.7680 25.1142 4.7969 18.2096 9.1287
temp: 298.150 k
press: 1.00000 atm
elementType: 17 14 6 6 6 6 6 1 1 1 1 1 1 1 1 1 1 1 1 1
symmnumber: 1
zpe: 436671.4 jmol-1
zpe.correction: 0.166319 hartree
zpe.thermalcorrener: 0.178144 hartree
zpe.thermalcorrenthalpy: 0.179088 hartree
zpe.thermalcorrgfe: 0.127930 hartree
zpe.sumelectzpe: -947.203375 hartree
zpe.sumelectthermal: -947.191551 hartree
zpe.sumelectthermalent: -947.190607 hartree
zpe.sumelectthermalfe: -947.241765 hartree
dipole: 2.5396 0.0750 -0.4664
dipole: 2.5831
quadrupole: -65.7408 -58.8618 -58.9883
quadrupole: -1.1611 0.1370 0.8726
quadrupole: -4.5438 2.3352 2.2086 -1.1611 0.1370 0.8726
hfenergy: -947.3696947 hartree
pointgroup: C01 [X(C5H13Cl1Si1)]
dipole: -0.9879605 0.1362441 0.1954296 debye
dipolederiv: -0.6366856 0.078076 0.065707 0.0954542 -0.2132358 -0.0090641 0.0707535 -0.0072139 -0.200213 1.243356 0.0594993 0.0192002 -0.1415517 1.2172496 0.0454311 0.0730783 -0.0126247 1.1790465 -0.2757436 -0.0398176 0.0141566 0.0003611 -0.271351 -0.040844 -0.0557754 -0.0407595 -0.1983394 0.3091648 -0.0179519 -0.1133548 0.0191717 -0.1897369 0.0142913 -0.1245214 0.0270926 -0.1152698 -0.3674393 -0.0912803 -0.0284596 -0.0459577 -0.3997778 -0.0680422 -0.0330206 -0.0556152 -0.3125151 -0.3323672 -0.0264267 0.0234486 0.0200488 -0.2884337 0.0052196 0.0112747 0.0255373 -0.4675384 -0.0003514 -0.0964253 -0.033318 0.0316573 0.0541128 -0.0356315 0.066402 0.0157876 0.0638467 0.0758282 -0.03159 0.032774 -0.0401483 0.0597317 0.0247905 0.0048289 -0.0045188 -0.180343 -0.0587028 0.1296162 -0.0222271 0.0710703 -0.1021347 0.0036831 -0.0221701 0.0091768 0.0887552 -0.020963 0.0076623 0.0031974 0.0120345 0.0877315 0.0675031 0.0058956 0.0589956 -0.1041565 -0.0145059 -0.0437131 0.0226326 -0.055612 -0.0871561 -0.0727855 0.0137751 -0.061042 0.0754365 -0.1067227 -0.056656 0.0380116 -0.06382 0.1085763 0.0116235 0.0281668 0.0075829 0.1016181 0.075732 0.0886419 -0.0215849 0.1043093 -0.1004649 0.0487247 -0.0178106 0.0401865 0.0919366 0.1059117 0.002838 -0.0042423 -0.0036344 0.1015333 -0.0184318 0.0036545 -0.0106162 -0.1561537 0.057234 0.0941855 -0.049814 0.0914322 -0.0559973 0.0717444 -0.06375 0.0867623 0.0637045 -0.065528 -0.0259534 0.0963005 -0.0230654 0.110606 0.0031383 0.1119128 0.0081247 0.0735461 0.0648167 -0.0717357 -0.0690524 -0.0768446 -0.0313132 -0.0951292 -0.0736103 -0.1182851 0.0244486 -0.2116995 -0.088316 0.0663265 -0.0751343 0.0523514 -0.0090067 0.0811303 -0.0019925 0.0675617 0.1092405 -0.0024101 0.0002243 0.0015808 0.0689687 0.0292015 -0.0456825 -0.0048224 -0.167721 0.0494252 0.1317568 -0.039926 0.0786483 -0.1212597 0.023584 -0.0345316 0.0382438 0.0723492 unknown
polarizability: 101.439768|1.5558042|80.0707951|-3.2927913|0.561366|78.1990651 unknown
InChI: InChI=1S/C5H13ClSi/c1-4-7(2,3)5-6/h4-5H2,1-3H3
charge 0 multiplicity 1
20 atoms
Cl 2.774955 -0.969263 -0.066174
Si -0.042413 0.437379 -0.005003
C  -1.84626 0.167816 0.622493
C  0.962518 -1.131847 0.499349
C  0.737066 1.961689 0.841248
C  0.004821 0.610962 -1.906288
C  -2.585977 -1.035312 -0.017839
H  -1.823095 0.053849 1.725591
H  -2.41263 1.101635 0.427323
H  1.013454 -1.27813 1.591018
H  0.597092 -2.056056 0.022845
H  1.80426 2.049278 0.568829
H  0.225946 2.891451 0.53022
H  0.670684 1.888567 1.942413
H  -0.517883 1.529054 -2.232508
H  1.050346 0.667728 -2.258919
H  -0.474487 -0.250805 -2.40578
H  -3.62076 -1.119628 0.363325
H  -2.646029 -0.933925 -1.117452
H  -2.075608 -1.992141 0.201309
