program: Gaussian 09
title: 000262822
version: EM64L-G09RevD.01
frameworkgroup: C1[X(C5H12Cl2Si)]
method: RPBEPBE
basis: SDD
operation: Freq
keyword: #p
keyword: freq=noraman
keyword: PBEPBE/SDD
title: #p freq=noraman PBEPBE/SDD
converged: YES YES NO NO
title: Mulliken charges:
elementType: Cl Cl Si C C C C C H H H H H H H H H H H H
charge: -0.087773 -0.086198 1.305100 -0.717180 -0.878955 -0.866575 -1.011431 -0.673742 0.225577 0.244534 0.296028 0.276712 0.291431 0.273644 0.236936 0.259113 0.240411 0.227690 0.231311 0.213366
chargesum: 0.00000
title: Mulliken charges with hydrogens summed into heavy atoms:
elementType: Cl Cl Si C C C C C
charge: -0.087773 -0.086198 1.305100 -0.247069 -0.306215 -0.301501 -0.274971 -0.001374
polarizability: 1.05541553e+02 -3.85800101e-01 9.45799732e+01 -7.76454291e+00 -4.96696397e+00 8.33333289e+01
1716.lowfreq: -12.4339 -4.5267 -0.0023 -0.0016 0.0019 14.3546 42.8946 50.4330 82.7732
frequency: 42.8570 50.3917 82.6133 85.4584 112.0454 124.5367 152.3427 172.8619 189.5520 222.1477 241.3746 283.1036 331.1440 557.7497 596.4065 616.1423 678.4060 678.5877 698.8838 735.4371 761.9419 796.5912 862.2717 871.2161 989.7263 995.1849 1022.9375 1084.6822 1096.0248 1185.7322 1193.8315 1243.4997 1251.9902 1300.8511 1392.8738 1411.6462 1412.8666 1439.7989 1448.0658 1453.7263 1481.7063 1489.0418 2975.0294 2982.7286 2986.6848 3038.7139 3041.7335 3044.2069 3066.4672 3075.5772 3087.2701 3096.9773 3125.8282 3128.0302
redmass: 9.2543 3.4409 2.3032 4.0507 1.0662 3.1359 2.5961 1.8191 2.4439 1.7364 4.8412 2.9566 3.1469 4.1876 7.2615 5.1328 2.8652 1.3473 2.9084 2.2940 1.9145 1.8400 1.4352 1.5543 1.3793 1.3071 2.6910 1.0424 1.0332 1.1784 1.1791 1.2240 1.3813 1.1920 1.1791 1.0781 1.0798 1.0759 1.0501 1.0535 1.0462 1.0419 1.0351 1.0592 1.0344 1.0988 1.0558 1.0559 1.0996 1.1003 1.0980 1.0984 1.1080 1.1080
irintensity: 1.6691 0.5769 2.3507 1.1311 0.1847 4.4869 0.7618 1.4705 1.0113 0.8241 4.1628 6.6814 8.6351 1.3483 23.5604 16.6926 4.4944 4.3576 2.3775 3.7526 44.1953 32.8736 71.8506 77.9010 7.8687 12.6335 34.6112 8.1618 4.4082 7.1215 0.9240 3.5724 3.8368 34.7853 6.2127 15.8604 12.6666 9.2164 8.8986 14.4746 6.6553 11.6527 41.4197 14.7718 11.0694 2.1854 10.9908 9.1172 40.2489 40.7307 13.7952 8.0993 3.7665 3.8499
temp: 298.150 k
press: 1.00000 atm
elementType: 17 17 14 6 6 6 6 6 1 1 1 1 1 1 1 1 1 1 1 1
symmnumber: 1
zpe: 415627.5 jmol-1
zpe.correction: 0.158304 hartree
zpe.thermalcorrener: 0.170955 hartree
zpe.thermalcorrenthalpy: 0.171899 hartree
zpe.thermalcorrgfe: 0.117867 hartree
zpe.sumelectzpe: -1406.588908 hartree
zpe.sumelectthermal: -1406.576257 hartree
zpe.sumelectthermalent: -1406.575313 hartree
zpe.sumelectthermalfe: -1406.629345 hartree
dipole: 1.5861 -2.5911 0.0330
dipole: 3.0383
quadrupole: -78.7846 -75.3259 -67.1735
quadrupole: -2.0075 0.8001 1.0695
quadrupole: -5.0233 -1.5645 6.5878 -2.0075 0.8001 1.0695
hfenergy: -1406.7472119 hartree
pointgroup: C01 [X(C5H12Cl2Si1)]
dipole: 0.8511974 0.8379955 -0.0454247 debye
dipolederiv: -0.1962827 0.0352653 -0.0137027 0.0359387 -0.5738525 0.1237738 -0.012598 0.121774 -0.2390903 -0.6435486 0.0101589 -0.0871168 0.0064581 -0.1821885 -0.0020865 -0.1045363 -0.002589 -0.2222965 1.2842048 0.00602 0.0056459 -0.007577 1.2486778 -0.0501905 -0.1408332 0.1256357 0.9912832 -0.3369763 0.0071856 0.0029385 0.0331055 -0.1822564 0.0127117 0.1703838 0.0025362 -0.2271187 -0.1725111 -0.0557627 0.0017565 -0.0438477 0.1732154 -0.2094282 0.0254538 -0.2471932 -0.0450884 0.2295909 -0.0060184 0.1856219 -0.0130152 -0.1621947 0.0288617 0.2130427 -0.0046742 -0.0710353 -0.3271338 0.0089337 -0.0249308 0.0114421 -0.429801 0.0954167 -0.0106013 0.0082664 -0.3304754 -0.0295308 0.0103142 0.052115 -0.0202913 0.0730559 -0.0170289 -0.1573732 -0.0165447 0.0469233 0.0417231 -0.036059 -0.0050745 -0.0018098 -0.0819186 -0.1250432 0.0206781 -0.1283689 0.0158136 0.0592013 0.028912 0.0020453 0.0071372 0.0074399 0.12604 0.0353091 0.110511 -0.0391646 0.004395 -0.0433076 -0.0937833 -0.0549164 0.0101054 0.0334176 -0.0942677 0.0325473 0.0370445 0.0214028 0.0460352 0.1009399 0.0646469 0.0040749 0.0330457 0.1054266 0.0373664 -0.0240764 0.0086269 -0.0411237 -0.0337001 -0.0373445 0.020353 0.0964308 -0.0302802 0.0978056 0.0136945 -0.0024736 0.0436556 -0.0306243 0.0283224 0.0010453 -0.1028673 -0.0275825 -0.1089194 -0.0034938 -0.0141957 -0.0190781 0.1260801 -0.0346345 0.1082648 0.0134598 0.1406895 0.0045046 0.00149 -0.0227066 0.0196086 -0.1125397 0.0327696 0.1207628 0.0076038 -0.1156702 0.0016614 0.0438606 0.1091887 -0.0066321 -0.0008268 -0.0051972 -0.1248439 -0.0818043 -0.0044949 -0.0501717 0.0596619 -0.1979578 -0.0125158 -0.0977815 -0.0070731 0.1022652 -0.0107466 -0.1059205 -0.0136814 0.0095972 0.0989284 -0.0103314 0.0099108 0.0376456 -0.0975228 -0.0998461 0.03405 -0.0934444 0.0291456 0.0860553 0.0147397 0.0130267 -0.0317595 -0.034682 0.1282802 0.0591241 0.1229784 -0.046675 unknown
polarizability: 105.0320313|-1.9137197|94.4381005|6.5205949|-7.175399|83.9847232 unknown
InChI: InChI=1S/C5H12Cl2Si/c1-3-8(2,4-6)5-7/h3-5H2,1-2H3
charge 0 multiplicity 1
20 atoms
Cl 0.235933 -2.687536 0.063795
Cl -3.087349 0.430607 0.058359
Si 0.045494 0.432418 -0.071344
C  1.631393 0.495151 1.007813
C  -0.004783 -1.194996 -1.0931
C  -1.487347 0.411191 1.089665
C  -0.060484 1.90684 -1.279573
C  2.942167 0.323157 0.196009
H  1.645944 1.461262 1.551884
H  1.564932 -0.298697 1.777068
H  -0.981892 -1.353467 -1.576854
H  0.799105 -1.270756 -1.842571
H  -1.540287 -0.509697 1.6924
H  -1.552449 1.29237 1.748126
H  0.777887 1.899922 -1.999771
H  -1.006781 1.877283 -1.848116
H  -0.026316 2.86457 -0.728236
H  3.827255 0.39665 0.854445
H  2.979472 -0.666395 -0.295507
H  3.046503 1.098421 -0.586192
