program: Gaussian 09
title: 000262806
version: EM64L-G09RevD.01
frameworkgroup: C1[X(C11H20O3)]
method: RPBEPBE
basis: SDD
operation: Freq
keyword: #pfreq=noraman
keyword: PBEPBE/SDD
title: #p freq=noraman PBEPBE/SDD
converged: YES YES NO NO
title: Mulliken charges:
elementType: O O O C C C C C C C C C C C H H H H H H H H H H H H H H H H H H H H
charge: -0.422611 -0.248632 -0.229503 0.330400 -0.023563 -0.490551 -0.579668 -0.754546 -0.753335 -0.741131 -0.498283 0.183813 0.230196 -0.776402 0.220706 0.218316 0.255261 0.255761 0.289171 0.218767 0.213245 0.210612 0.213753 0.228089 0.210693 0.208951 0.233341 0.218009 0.270319 0.204608 0.253852 0.243919 0.236802 0.369643
chargesum: 0.00000
title: Mulliken charges with hydrogens summed into heavy atoms:
elementType: O O O C C C C C C C C C C C
charge: -0.052968 -0.248632 -0.229503 0.330400 0.197142 -0.016974 -0.034736 -0.111923 -0.100800 -0.080830 -0.023356 0.183813 0.230196 -0.041829
polarizability: 1.39239004e+02 5.65094824e+00 1.22799526e+02 -4.76652950e+00 -9.17827409e-03 1.15963959e+02
1716.lowfreq: -23.4097 -11.2494 -6.0819 -0.0006 -0.0003 0.0006 14.2336 29.6874 50.1004
frequency: 13.5561 29.5436 49.9443 57.3237 82.8591 93.2188 131.3322 148.0473 183.0098 208.8411 226.2960 252.3869 266.6844 289.4731 302.2539 328.3501 344.2318 385.2921 386.5844 407.1892 435.7406 478.5564 501.1583 522.7987 523.7520 594.1687 651.3321 672.5064 715.4970 756.1887 794.3059 836.3125 870.1502 903.3243 918.4620 922.7205 932.6150 940.3787 974.3518 994.5531 1002.9491 1021.0852 1026.2160 1052.7495 1073.6368 1116.0173 1149.1043 1176.3734 1201.1235 1207.7860 1233.8363 1236.8775 1245.6645 1275.5382 1290.4109 1316.9112 1322.7665 1355.2709 1365.3779 1376.5364 1378.1803 1381.1144 1405.9565 1440.5033 1450.7283 1455.7094 1461.1823 1464.9509 1467.0274 1475.6063 1481.8084 1492.4228 1492.9312 1505.7686 1619.8010 1651.4470 2957.0175 2968.3335 2971.7040 2977.2070 2978.3092 2988.8339 2998.7096 3007.3979 3058.1202 3059.2306 3060.1377 3063.0825 3067.9381 3072.2609 3077.9941 3081.5825 3083.8899 3101.9316 3120.3064 3500.2928
redmass: 3.8634 3.9571 3.5446 7.8936 4.7004 4.4380 1.0649 4.2098 2.5120 2.7286 1.6254 1.3996 1.1392 1.6607 2.2931 2.2853 2.8419 2.2019 2.0666 2.3647 2.8212 2.0993 3.2297 2.2564 3.5183 2.3214 1.4507 2.3864 3.5294 3.2900 2.8987 2.7720 2.0378 1.8271 2.0783 1.7216 1.6036 1.2110 2.2087 1.8687 1.8423 1.4582 1.6593 2.1177 2.1106 2.5575 1.4263 1.5099 1.6655 1.6173 2.3134 2.1277 1.8930 1.5724 1.5088 1.4374 1.2647 1.4119 1.2677 1.2796 1.3632 1.2246 1.2093 1.0750 1.0638 1.0671 1.1050 1.0553 1.0479 1.0707 1.0693 1.0614 1.0539 1.0581 7.4152 7.7571 1.0820 1.0359 1.0358 1.0375 1.0369 1.0692 1.0600 1.0611 1.1004 1.0981 1.0976 1.0990 1.0979 1.0996 1.0979 1.0990 1.1002 1.0910 1.1002 1.0637
irintensity: 0.7165 4.3410 0.6614 1.8897 0.3504 7.7480 0.3690 1.8009 0.3972 0.3667 0.3689 0.1470 0.0166 0.1574 0.5776 0.5206 0.5689 2.8712 0.4394 2.9581 0.8918 4.7414 24.4156 9.7734 20.7068 1.8447 117.2669 35.4124 21.5355 1.1752 2.6123 12.3356 3.0772 24.4690 3.6127 1.9602 3.6817 0.1642 17.1302 2.6367 2.0952 1.4491 37.4396 215.3562 11.9684 93.1914 26.5601 0.6772 10.8074 21.4435 6.2443 47.5577 12.4525 9.7553 4.4465 30.1145 9.6606 16.6744 78.4895 38.8597 5.2133 18.5858 15.9802 22.7185 11.1889 7.8046 21.8930 0.8560 2.8704 6.8894 8.7448 34.8505 9.4124 14.7017 74.9159 203.9369 25.3298 28.6389 38.7056 3.1750 14.0537 21.0857 21.4362 28.9898 0.6923 8.0126 8.0670 31.2854 87.6780 9.2350 56.8434 35.9934 29.3511 7.7193 14.4343 21.3673
temp: 298.150 k
press: 1.00000 atm
elementType: 8 8 8 6 6 6 6 6 6 6 6 6 6 6 1 1 1 1 1 1 1 1 1 1 1 1 1 1 1 1 1 1 1 1
symmnumber: 1
zpe: 765555.8 jmol-1
zpe.correction: 0.291585 hartree
zpe.thermalcorrener: 0.308628 hartree
zpe.thermalcorrenthalpy: 0.309572 hartree
zpe.thermalcorrgfe: 0.245393 hartree
zpe.sumelectzpe: -655.711515 hartree
zpe.sumelectthermal: -655.694472 hartree
zpe.sumelectthermalent: -655.693528 hartree
zpe.sumelectthermalfe: -655.757707 hartree
dipole: -0.1544 1.9906 -1.6521
dipole: 2.5915
quadrupole: -79.8024 -86.0577 -93.2378
quadrupole: 5.7506 -6.0984 -0.0017
quadrupole: 6.5636 0.3082 -6.8718 5.7506 -6.0984 -0.0017
hfenergy: -656.0030997 hartree
pointgroup: C01 [X(C11H20O3)]
dipole: -0.0562616 0.7292736 0.7102788 debye
polarizability: 140.6472905|-3.1734084|121.7587989|-4.1572864|-0.1866606|115.5963991 unknown
InChI: InChI=1S/C11H20O3/c1-8(12)5-6-9(7-10(13)14)11(2,3)4/h9,13H,5-7H2,1-4H3
charge 0 multiplicity 1
34 atoms
O  2.89071 -2.11997 -0.756773
O  1.255652 -2.475499 0.843418
O  -2.443747 -1.111103 -1.727925
C  1.245159 1.434942 0.003988
C  0.193483 0.300168 -0.333697
C  -0.693001 -0.08712 0.884344
C  0.801074 -0.946324 -1.060985
C  0.495186 2.68539 0.550156
C  1.985366 1.863552 -1.295241
C  2.301039 0.990715 1.052504
C  -1.773159 -1.183721 0.612471
C  1.613165 -1.893777 -0.209137
C  -2.709786 -0.804149 -0.530359
C  -3.961177 -0.010939 -0.174389
H  -0.477653 0.747477 -1.098701
H  -1.199955 0.822866 1.255229
H  -0.065025 -0.470267 1.707994
H  1.413773 -0.628685 -1.91729
H  -0.050666 -1.523316 -1.47362
H  0.067472 2.511768 1.553902
H  1.194805 3.537736 0.635211
H  -0.325717 2.989835 -0.127969
H  1.268881 2.129487 -2.096317
H  2.650098 1.068169 -1.676149
H  2.616431 2.75037 -1.098491
H  2.968347 1.839853 1.293836
H  2.938232 0.173014 0.670852
H  1.834946 0.655869 1.996504
H  -1.268585 -2.136422 0.379216
H  -2.353391 -1.322602 1.544215
H  -4.458207 0.361423 -1.083503
H  -4.665618 -0.66017 0.381396
H  -3.713485 0.834821 0.494494
H  3.372255 -2.779989 -0.185888
