program: Gaussian 09
title: 000262811
version: EM64L-G09RevD.01
frameworkgroup: C1[X(C11H18O3)]
method: RPBEPBE
basis: SDD
operation: Freq
keyword: #pfreq=noraman
keyword: PBEPBE/SDD
title: #p freq=noraman PBEPBE/SDD
converged: YES YES NO NO
title: Mulliken charges:
elementType: O O O C C C C C C C C C C C H H H H H H H H H H H H H H H H H H
charge: -0.268710 -0.240913 -0.216337 -0.178734 -0.428533 -0.552227 -0.505654 0.536402 -0.843581 0.250882 0.229642 -0.751796 -0.776305 -0.504184 0.238583 0.227860 0.215379 0.240567 0.234935 0.261276 0.228817 0.225493 0.232473 0.247983 0.228572 0.221465 0.239984 0.255632 0.233990 0.241552 0.243984 0.231503
chargesum: 0.00000
title: Mulliken charges with hydrogens summed into heavy atoms:
elementType: O O O C C C C C C C C C C C
charge: -0.268710 -0.240913 -0.216337 0.059850 0.014706 -0.076726 -0.015561 0.536402 -0.137632 0.250882 0.229642 -0.301759 -0.046699 0.212855
polarizability: 1.47107423e+02 -5.93245431e+00 1.12412141e+02 -1.58924622e+00 -8.61691808e+00 1.19286385e+02
1716.lowfreq: -12.8830 -5.2652 -0.0005 0.0002 0.0007 2.3244 19.1640 28.5801 36.3465
frequency: 18.9034 28.5310 36.2767 44.0666 60.4545 66.9725 91.1059 101.5501 116.1269 133.5505 158.5941 190.4026 203.6309 238.5402 261.8775 278.6191 347.7265 393.4587 405.9405 430.4705 465.9272 504.0872 546.6223 584.5273 613.4818 688.0478 714.3999 723.9947 768.0879 813.8726 827.1219 899.4352 926.1506 943.6764 948.0826 956.0056 978.2452 1000.5476 1032.2682 1052.7253 1057.9647 1072.3186 1089.2057 1112.5953 1116.4485 1149.3093 1154.2736 1172.7331 1217.4845 1245.6205 1272.1486 1289.8096 1308.6647 1322.8311 1333.0869 1355.3486 1368.9340 1394.4852 1421.4836 1432.2291 1434.1154 1443.3032 1448.1199 1452.9240 1456.4450 1463.3743 1465.9454 1478.2663 1483.2673 1633.2284 1645.3361 1660.6608 2957.3505 2971.8238 2980.1101 2990.9918 2992.6637 3004.8657 3005.2014 3012.9184 3046.8903 3054.4560 3065.9850 3084.8705 3086.5372 3090.6032 3107.0834 3120.4266 3148.5840 3189.5163
redmass: 5.0641 4.0935 4.1126 2.9397 2.8958 3.8028 1.2222 1.1165 1.9853 2.9750 2.1829 1.5972 4.3034 3.2347 2.9076 2.7768 3.9998 2.7141 2.7366 2.2258 2.1950 2.9598 2.8146 3.4563 3.3907 2.8723 1.9442 1.3021 1.8145 5.3924 3.3794 1.4779 1.9626 2.1934 1.3258 3.2324 1.7316 1.3983 2.9733 1.6933 1.8441 3.3679 2.7314 1.2864 1.8885 1.4375 1.4432 1.9421 1.7644 1.3771 1.2479 1.8440 1.5642 1.4703 1.4135 1.6787 1.2465 1.2329 1.1809 1.0941 1.1865 1.0671 1.0936 1.0502 1.0578 1.0528 1.0650 1.0653 1.0698 7.6325 9.3022 4.9179 1.0615 1.0374 1.0383 1.0740 1.0727 1.0298 1.0932 1.0613 1.0976 1.1000 1.0950 1.0944 1.0663 1.0998 1.1045 1.1004 1.1048 1.1139
irintensity: 4.5181 4.1477 0.5370 0.5240 0.6505 1.5260 0.8886 0.6678 1.0577 0.6970 4.9765 1.8860 2.8657 5.0179 6.7364 6.8774 4.6643 1.1086 3.1105 2.2847 4.7696 9.0374 23.6402 0.0311 3.1950 2.9457 9.0738 3.8446 0.1638 9.4284 1.7722 1.6488 1.7114 1.6287 86.6558 18.3005 8.8637 6.7135 7.7630 18.8821 16.2909 4.4813 4.6768 5.0520 137.1526 6.7472 6.0304 29.5613 112.6079 95.1911 1.2314 6.4386 16.4888 29.5100 19.6394 34.6912 64.2652 32.0803 19.1068 23.5185 0.7909 19.8325 7.1243 14.3968 16.8557 8.4141 24.6347 18.0264 4.8527 117.2015 139.0665 23.8908 18.0447 19.2772 4.4840 9.8823 22.4924 31.5972 4.4520 17.0989 21.0613 28.9072 15.3184 29.3078 3.5811 12.0573 26.0896 15.0179 15.9893 21.3046
temp: 298.150 k
press: 1.00000 atm
elementType: 8 8 8 6 6 6 6 6 6 6 6 6 6 6 1 1 1 1 1 1 1 1 1 1 1 1 1 1 1 1 1 1
symmnumber: 1
zpe: 702548.5 jmol-1
zpe.correction: 0.267587 hartree
zpe.thermalcorrener: 0.285126 hartree
zpe.thermalcorrenthalpy: 0.286070 hartree
zpe.thermalcorrgfe: 0.218946 hartree
zpe.sumelectzpe: -654.511437 hartree
zpe.sumelectthermal: -654.493897 hartree
zpe.sumelectthermalent: -654.492953 hartree
zpe.sumelectthermalfe: -654.560077 hartree
dipole: -0.4930 1.8164 -0.7688
dipole: 2.0331
quadrupole: -79.2319 -84.1775 -91.4822
quadrupole: 2.0485 -16.4739 1.3029
quadrupole: 5.7320 0.7864 -6.5184 2.0485 -16.4739 1.3029
hfenergy: -654.7790235 hartree
pointgroup: C01 [X(C11H18O3)]
dipole: 0.211222 -0.7637079 -0.1093175 debye
polarizability: 147.3945553|-4.5132607|116.9411334|2.5411105|9.2948742|114.4702611 unknown
InChI: InChI=1S/C11H18O3/c1-8(2)10(6-5-9(3)12)7-11(13)14-4/h10H,1,5-7H2,2-4H3
charge 0 multiplicity 1
32 atoms
O  3.456789 0.60626 0.612661
O  2.911181 0.614672 -1.652677
O  -3.951362 1.10106 0.9989
C  0.116827 0.16042 -0.3384
C  -1.286656 0.725216 0.025272
C  1.204185 1.222621 0.024669
C  -2.437356 -0.194725 -0.419182
C  0.398485 -1.194007 0.324487
C  0.445606 -1.245043 1.842989
C  2.57663 0.797372 -0.459853
C  -3.814331 0.24103 0.087461
C  0.603999 -2.306014 -0.431721
C  -5.019703 -0.424813 -0.568835
C  4.820462 0.151005 0.245697
H  0.162256 0.015679 -1.436537
H  -1.367212 0.904265 1.113597
H  -1.409414 1.717076 -0.452476
H  1.231748 1.409371 1.110607
H  0.945214 2.171239 -0.482558
H  -2.263735 -1.229059 -0.050836
H  -2.473492 -0.289691 -1.523977
H  0.579218 -2.280114 2.200784
H  -0.479849 -0.8426 2.297659
H  1.28759 -0.642752 2.234869
H  0.593586 -2.264719 -1.527528
H  0.804842 -3.283356 0.023506
H  -5.203204 0.043662 -1.556003
H  -5.918736 -0.289669 0.052572
H  -4.839202 -1.499998 -0.749493
H  5.300791 0.884429 -0.423552
H  4.769198 -0.825024 -0.265311
H  5.357946 0.07251 1.201012
