program: Gaussian 09
title: 000262896
version: EM64L-G09RevD.01
frameworkgroup: C1[X(C14H36N2OSi2)]
method: RPBEPBE
basis: SDD
operation: Freq
keyword: #p
keyword: freq=noraman
keyword: PBEPBE/SDD
title: #p freq=noraman PBEPBE/SDD
converged: YES YES NO NO
title: Mulliken charges:
elementType: Si Si O N N C C C C C C C C C C C C C C H H H H H H H H H H H H H H H H H H H H H H H H H H H H H H H H H H H H
charge: 1.488583 1.488509 -1.003654 -0.101990 -0.102081 -0.769857 -0.769222 -1.049364 -1.035322 -1.035317 -1.048957 -0.310890 -0.296540 -0.310608 -0.296349 -0.690793 -0.686073 -0.690820 -0.686704 0.220828 0.213804 0.220750 0.213389 0.241464 0.235008 0.234716 0.260179 0.230231 0.231942 0.260137 0.230067 0.232054 0.241344 0.235009 0.234648 0.252685 0.174361 0.203302 0.176003 0.253326 0.173686 0.203335 0.175698 0.206626 0.222745 0.207713 0.207075 0.227500 0.208032 0.206609 0.222758 0.207540 0.207113 0.227566 0.208210
chargesum: 0.00000
title: Mulliken charges with hydrogens summed into heavy atoms:
elementType: Si Si O N N C C C C C C C C C C C C C C
charge: 1.488583 1.488509 -1.003654 -0.101990 -0.102081 -0.335225 -0.335083 -0.338177 -0.312970 -0.313060 -0.337957 0.116156 0.082765 0.116403 0.082684 -0.053709 -0.043465 -0.053913 -0.043816
polarizability: 2.41967462e+02 -4.21137311e-02 2.19865892e+02 -4.51470308e+00 -6.25273129e-04 1.98452371e+02
1716.lowfreq: -0.0009 0.0005 0.0014 8.5294 8.9403 12.3748 20.8390 21.7250 25.9769
frequency: 10.8752 21.4054 25.6904 37.3804 46.6933 54.0412 65.4145 67.0046 73.3571 81.6290 84.9080 112.9898 115.2106 125.3846 127.0950 136.1101 145.6228 147.6353 149.5196 160.3930 180.1613 188.9162 190.3313 204.6467 219.3113 223.2375 232.0833 240.7364 251.1767 271.9745 280.1806 293.7103 294.0346 306.4918 312.2445 374.4695 378.1895 424.9134 434.4018 472.6062 473.8195 477.0698 611.4905 638.3711 678.8223 679.6195 702.1742 704.1586 751.7296 753.2819 780.6640 783.2455 798.3488 798.5479 799.1267 802.1174 807.6370 809.8359 831.6144 840.0767 875.9101 904.3276 907.2451 911.9256 930.5917 939.5622 988.4004 989.7193 998.8115 1069.7163 1070.0062 1074.9138 1074.9951 1087.2558 1087.9318 1102.7764 1105.4141 1151.9405 1152.2088 1194.7462 1197.8545 1228.0009 1229.2014 1262.4209 1263.2640 1289.2690 1290.2743 1294.4259 1295.9476 1301.9572 1304.0422 1313.1537 1313.2835 1364.4928 1364.9069 1380.5961 1381.5035 1385.5053 1385.9191 1388.5514 1388.7702 1435.3258 1435.8233 1437.0168 1439.9169 1443.7364 1444.5235 1449.1897 1452.1911 1454.3547 1456.0226 1463.7110 1463.9158 1467.4883 1468.3134 1471.5764 1472.5431 1479.9681 1483.1159 1488.0506 1489.0245 1493.8589 1498.4123 2822.7074 2824.0641 2829.2926 2834.0937 2846.6261 2848.3178 2978.4097 2978.7014 2979.9228 2980.1997 2981.7669 2981.9671 2985.4919 2985.8118 3017.2066 3017.6210 3033.4163 3035.0732 3036.6316 3036.7950 3072.0755 3072.3662 3074.8230 3075.1032 3080.1348 3080.5376 3084.3797 3084.7655 3085.7542 3085.9513 3086.9128 3087.3343 3088.9648 3089.1347 3098.8131 3099.3559
redmass: 3.2068 3.3589 3.5937 3.8427 3.4610 3.5248 2.2781 2.2969 3.0390 2.0495 2.1327 1.6848 1.5991 1.1702 1.2137 2.4760 2.6802 1.0864 1.0670 2.0346 2.2046 1.8672 1.6587 2.0343 1.4881 1.4282 2.4969 2.2996 2.2104 2.0857 2.4309 1.9822 2.3606 2.1446 3.4376 2.9885 3.4331 2.8651 2.8335 2.7076 2.7044 4.6158 3.5857 3.5016 3.1374 3.1512 2.4092 2.3654 2.5137 2.5509 1.5200 1.5188 1.1535 1.1547 1.1848 1.1978 1.2867 1.3029 1.7626 1.8614 1.5491 1.5033 1.7618 1.5343 1.8672 1.8362 2.4213 2.3121 10.5688 2.5574 2.4254 2.1720 2.1687 1.8931 1.8799 1.9868 1.9419 1.7136 1.7170 2.4177 2.3948 1.3100 1.3093 1.2331 1.2377 1.1707 1.1700 1.2091 1.2065 1.2109 1.2217 1.3411 1.3364 1.3282 1.3265 1.2585 1.2495 1.2390 1.2415 1.2743 1.2813 1.0753 1.0603 1.0768 1.0613 1.0525 1.0549 1.0499 1.0498 1.0497 1.0495 1.0598 1.0601 1.0499 1.0492 1.0523 1.0539 1.0532 1.0421 1.0592 1.0603 1.0771 1.0827 1.0708 1.0703 1.0718 1.0725 1.0703 1.0705 1.0344 1.0344 1.0357 1.0357 1.0357 1.0357 1.0342 1.0342 1.0836 1.0836 1.0884 1.0878 1.0871 1.0870 1.0983 1.0983 1.0975 1.0974 1.0979 1.0977 1.1001 1.1001 1.0984 1.0984 1.0979 1.0977 1.1003 1.1003 1.0983 1.0983
irintensity: 0.0428 0.1315 0.0041 0.0022 0.9704 1.5714 0.0777 0.1090 2.4450 0.4765 0.0782 0.0810 0.0147 0.1442 0.1660 0.5516 0.2417 0.0394 0.0213 0.3920 0.6623 0.3372 2.1135 1.5727 0.2234 0.1673 9.4438 3.1877 0.7855 2.1142 1.2713 1.2834 1.8777 5.0386 32.3936 3.6621 44.0485 4.5593 15.3054 11.3383 1.4645 2.2508 2.6733 18.9107 8.4615 3.8192 4.7136 17.4701 4.6834 19.3691 6.2745 25.9180 0.4252 0.0411 5.6655 1.2352 11.2666 4.0795 1.5330 147.5452 152.6637 8.1387 23.0387 218.4479 7.6933 0.9994 39.0104 12.4814 635.3615 5.9010 38.4701 7.0223 9.1958 5.7441 8.0180 44.8412 3.2477 11.6193 20.2663 6.4050 25.6098 31.8841 14.4740 14.2614 4.5906 29.7229 4.2506 7.8974 84.7519 33.5305 61.6425 9.0666 5.7829 9.0167 7.9617 1.7937 0.3251 29.9922 15.4375 45.9838 5.5277 1.1622 2.3106 0.3275 14.2651 0.0789 4.8725 6.7109 7.7913 22.1460 7.2885 4.1378 3.4639 11.7167 1.8691 12.0594 6.2604 4.1906 6.2870 17.1347 16.9550 14.3775 1.1004 31.3370 16.5913 134.6551 1.3010 245.9181 194.3830 13.3567 14.3610 35.9740 26.6685 42.5594 20.9172 11.8209 12.4123 27.5190 19.4396 1.0145 0.2240 12.6706 12.9453 27.8972 21.3178 93.2818 83.5332 4.8957 30.0079 6.0081 77.5974 18.6796 16.5828 47.9974 5.4710 32.9159 40.9089 11.4816 15.6797
temp: 298.150 k
press: 1.00000 atm
elementType: 14 14 8 7 7 6 6 6 6 6 6 6 6 6 6 6 6 6 6 1 1 1 1 1 1 1 1 1 1 1 1 1 1 1 1 1 1 1 1 1 1 1 1 1 1 1 1 1 1 1 1 1 1 1 1
symmnumber: 1
zpe: 1261427.8 jmol-1
zpe.correction: 0.480452 hartree
zpe.thermalcorrener: 0.510618 hartree
zpe.thermalcorrenthalpy: 0.511563 hartree
zpe.thermalcorrgfe: 0.416745 hartree
zpe.sumelectzpe: -1317.042487 hartree
zpe.sumelectthermal: -1317.012321 hartree
zpe.sumelectthermalent: -1317.011377 hartree
zpe.sumelectthermalfe: -1317.106194 hartree
dipole: -0.0005 -0.0467 0.0065
dipole: 0.0472
quadrupole: -135.9538 -132.8775 -138.9607
quadrupole: -0.0359 -5.7542 -0.0278
quadrupole: -0.0231 3.0532 -3.0301 -0.0359 -5.7542 -0.0278
hfenergy: -1317.5229391 hartree
pointgroup: C01 [X(C14H36N2O1Si2)]
dipole: 0.0001793 -0.0183283 -0.0028826 debye
polarizability: 241.8754644|0.1485018|219.8597508|-4.9350725|0.3647711|198.5505102 unknown
InChI: InChI=1S/C14H36N2OSi2/c1-9-15(10-2)13-18(5,6)17-19(7,8)14-16(11-3)12-4/h9-14H2,1-8H3
charge 0 multiplicity 1
55 atoms
Si -1.642832 1.656306 0.333858
Si 1.650457 1.669145 -0.255447
O  0.003789 1.259915 0.03021
N  -2.967877 -0.857493 -0.15314
N  2.966984 -0.865368 0.144842
C  -2.538925 0.060425 0.936352
C  2.55248 0.097943 -0.910639
C  -1.710598 2.958885 1.732086
C  -2.430731 2.307107 -1.271583
C  2.432913 2.266352 1.373483
C  1.719459 3.018661 -1.608248
C  -1.804672 -1.535002 -0.793099
C  -4.009351 -1.822901 0.296718
C  1.79497 -1.568584 0.739701
C  4.011884 -1.813246 -0.333834
C  -2.119569 -2.096586 -2.192656
C  -5.389491 -1.174205 0.515437
C  2.090827 -2.190795 2.117556
C  5.394466 -1.158298 -0.515315
H  -3.440922 0.40659 1.478425
H  -1.897449 -0.453626 1.701438
H  3.462018 0.465173 -1.425637
H  1.921072 -0.383255 -1.705001
H  -1.247373 2.568227 2.656722
H  -1.170699 3.879864 1.443823
H  -2.755089 3.240097 1.963979
H  -2.503575 1.489907 -2.010465
H  -3.454305 2.682078 -1.086394
H  -1.831051 3.12846 -1.704532
H  2.505443 1.425194 2.085062
H  3.45625 2.649325 1.203803
H  1.830697 3.071689 1.832212
H  1.26681 2.655829 -2.549303
H  1.169822 3.925188 -1.293832
H  2.763463 3.315612 -1.821781
H  -0.994418 -0.788933 -0.881202
H  -1.403646 -2.352023 -0.136857
H  -4.110848 -2.595186 -0.48696
H  -3.688183 -2.353559 1.231211
H  0.984093 -0.826151 0.84934
H  1.40247 -2.356342 0.043514
H  4.10586 -2.615664 0.419907
H  3.69786 -2.306044 -1.291247
H  -2.872789 -2.904971 -2.16727
H  -2.504439 -1.29328 -2.845863
H  -1.202346 -2.513217 -2.649617
H  -5.378788 -0.433572 1.33576
H  -5.716864 -0.660998 -0.405804
H  -6.138406 -1.94531 0.776057
H  2.845093 -2.997095 2.067661
H  2.465301 -1.416762 2.810875
H  1.167547 -2.627542 2.542457
H  5.393095 -0.389514 -1.309378
H  5.712388 -0.678107 0.426822
H  6.145623 -1.92054 -0.794804
