program: Gaussian 09
title: 000262793
version: EM64L-G09RevD.01
frameworkgroup: C1[X(C9H16O4S2)]
method: RPBEPBE
basis: SDD
operation: Freq
keyword: #p
keyword: freq=noraman
keyword: PBEPBE/SDD
title: #p freq=noraman PBEPBE/SDD
converged: YES YES NO NO
title: Mulliken charges:
elementType: S S O O O O C C C C C C C C C H H H H H H H H H H H H H H H H
charge: 0.034320 0.033884 -0.262944 -0.262263 -0.251791 -0.245169 -0.426193 -0.686663 -0.683886 -0.416469 0.267272 -0.263411 0.255765 -0.662934 -0.504686 0.260255 0.267424 0.290927 0.279110 0.282663 0.287069 0.270453 0.261780 0.234317 0.224455 0.249067 0.228690 0.218392 0.235411 0.242902 0.242251
chargesum: 0.00000
title: Mulliken charges with hydrogens summed into heavy atoms:
elementType: S S O O O O C C C C C C C C C
charge: 0.034320 0.033884 -0.262944 -0.262263 -0.251791 -0.245169 0.101487 -0.116625 -0.114154 0.115763 0.267272 0.195360 0.255765 0.033215 0.215879
polarizability: 1.97658928e+02 -2.51556061e+00 1.27013460e+02 -3.20699807e+00 3.30182897e+00 1.24955509e+02
1716.lowfreq: -6.7353 -4.2755 -0.4654 -0.0019 0.0011 0.0012 7.6493 13.7246 17.7738
frequency: 4.1311 13.5546 17.5962 27.2249 42.5574 68.0240 69.1211 74.3296 96.8917 110.8152 122.2643 131.8466 150.1599 175.5745 207.7533 219.2715 277.5492 279.1401 290.7569 301.7277 361.7268 405.0911 418.2688 448.2672 553.7559 559.9945 624.5101 626.1024 688.3919 693.6143 755.7219 757.6293 793.7100 818.5217 846.7484 895.4538 946.6989 976.0274 981.0054 1010.5548 1072.7993 1076.8537 1094.4542 1113.7827 1121.9947 1133.8317 1143.9627 1149.3666 1149.9892 1156.3366 1236.1569 1246.0284 1264.6834 1266.6248 1277.8069 1328.2621 1335.7446 1357.9493 1389.1517 1423.6492 1430.9716 1431.1816 1441.7297 1442.8157 1453.6056 1457.7091 1462.6274 1464.0666 1484.3805 1634.5051 1640.9858 2989.5456 2993.0000 2999.9108 3005.7831 3028.1304 3030.1497 3032.2775 3059.7495 3068.5438 3088.2422 3093.5365 3107.7050 3112.1866 3113.6576 3119.8007 3151.0730
redmass: 4.7957 6.8006 7.2552 4.1949 4.2559 3.4641 3.3850 2.7134 1.0765 3.3771 2.3238 4.8141 3.2656 3.1578 2.8776 1.4946 5.9103 5.0408 9.2275 2.7416 3.8453 7.0376 8.1136 3.6857 2.6372 2.8171 5.8609 6.2621 3.7661 4.8093 1.3550 1.3798 1.6993 2.0310 5.5558 3.6999 6.3340 1.6899 1.7335 2.8107 4.0664 3.9127 2.1958 1.2652 1.7933 1.8521 1.5754 1.4320 1.6153 1.6584 1.2841 1.2859 1.1296 1.1300 1.1196 1.5788 1.6219 1.3685 1.2326 1.1848 1.0923 1.0922 1.0884 1.0924 1.0499 1.0921 1.0439 1.0507 1.0518 8.8147 8.8888 1.0658 1.0360 1.0618 1.0303 1.0604 1.0597 1.0601 1.0973 1.0945 1.0973 1.1030 1.1046 1.1035 1.1038 1.1062 1.1048
irintensity: 1.2616 0.1710 1.4899 0.2095 0.2933 0.6900 0.4691 0.4609 0.2587 3.8830 0.4622 1.3876 3.8390 8.1268 7.3662 3.3411 3.2216 29.7983 1.0313 19.7725 4.6232 0.9087 0.6234 1.1268 1.6630 2.8979 9.5655 15.9978 7.2683 12.1030 29.2281 10.2642 4.6101 7.6460 7.6710 10.5126 19.7069 0.4704 2.2403 50.6096 62.7222 16.7814 48.4171 0.0212 210.0814 161.8421 118.1590 6.6181 76.8515 8.6155 78.6735 0.0365 0.6934 0.2408 4.2712 188.1961 24.1516 13.8700 22.2319 21.7527 3.4568 4.1259 21.8225 58.1361 14.5162 11.8821 14.0108 12.6761 12.7667 140.1133 171.7889 17.2022 17.5272 20.2172 27.7794 7.8277 31.4599 6.3740 1.2351 1.5547 36.5091 0.6828 25.8725 5.7816 4.2210 33.3315 15.7927
temp: 298.150 k
press: 1.00000 atm
elementType: 16 16 8 8 8 8 6 6 6 6 6 6 6 6 6 1 1 1 1 1 1 1 1 1 1 1 1 1 1 1 1
symmnumber: 1
zpe: 637127.4 jmol-1
zpe.correction: 0.242669 hartree
zpe.thermalcorrener: 0.262384 hartree
zpe.thermalcorrenthalpy: 0.263328 hartree
zpe.thermalcorrgfe: 0.186805 hartree
zpe.sumelectzpe: -1448.376958 hartree
zpe.sumelectthermal: -1448.357243 hartree
zpe.sumelectthermalent: -1448.356299 hartree
zpe.sumelectthermalfe: -1448.432822 hartree
dipole: 0.2185 -0.0220 -0.0118
dipole: 0.2199
quadrupole: -71.1402 -115.8353 -103.4421
quadrupole: 0.2838 4.3497 3.0866
quadrupole: 25.6656 -19.0294 -6.6362 0.2838 4.3497 3.0866
hfenergy: -1448.6196269 hartree
pointgroup: C01 [X(C9H16O4S2)]
dipole: 0.0857083 -0.0046361 -0.0107857 debye
polarizability: 197.4367165|-0.4217711|123.1560335|-5.62027|2.0142616|129.0351465 unknown
InChI: InChI=1S/C9H16O4S2/c1-3-13-9(11)5-7-15-14-6-4-8(10)12-2/h3-7H2,1-2H3
charge 0 multiplicity 1
31 atoms
S  -0.218031 -1.365368 -1.779784
S  -0.698961 -2.049297 0.332221
O  4.75172 -0.498555 -0.363183
O  -5.437624 0.12363 -0.236568
O  3.401952 1.406238 -0.442265
O  -4.044969 1.18545 1.300786
C  2.436786 -0.832743 -0.877734
C  1.186271 -0.139521 -1.430972
C  -1.942293 -0.714333 0.84861
C  -3.243716 -0.796836 0.043215
C  3.537729 0.164159 -0.546926
C  5.924726 0.346104 0.031151
C  -4.237251 0.276625 0.460314
C  5.961753 0.548144 1.548327
C  -6.491994 1.122112 0.071032
H  2.827147 -1.589237 -1.58051
H  2.177341 -1.376448 0.053208
H  0.81745 0.639602 -0.746508
H  1.374113 0.329398 -2.413893
H  -2.108709 -0.907278 1.923549
H  -1.461837 0.27105 0.750597
H  -3.030606 -0.675409 -1.036857
H  -3.720105 -1.788168 0.15253
H  5.856751 1.310885 -0.501665
H  6.789727 -0.231224 -0.332073
H  5.094871 1.139895 1.886971
H  5.962643 -0.421767 2.074885
H  6.881582 1.094248 1.82887
H  -7.340932 0.837093 -0.565565
H  -6.136928 2.138328 -0.169058
H  -6.761305 1.076218 1.139594
