program: Gaussian 09
title: 000262753
version: EM64L-G09RevD.01
frameworkgroup: C1[X(C14H14OS)]
method: RPBEPBE
basis: SDD
operation: Freq
keyword: #p
keyword: freq=noraman
keyword: PBEPBE/SDD
title: #p freq=noraman PBEPBE/SDD
converged: YES YES NO NO
title: Mulliken charges:
elementType: S O C C C C C C C C C C C C C C H H H H H H H H H H H H H H
charge: 0.191890 -0.265767 0.485946 -0.845567 -0.379122 -0.352536 0.323128 -0.349048 -0.349015 -0.161753 -0.169235 -0.246523 -0.252994 -0.213868 -0.241135 -0.538491 0.270737 0.270387 0.235019 0.239397 0.240703 0.251376 0.245304 0.240631 0.224551 0.227265 0.228888 0.220950 0.222662 0.246220
chargesum: 0.00000
title: Mulliken charges with hydrogens summed into heavy atoms:
elementType: S O C C C C C C C C C C C C C C
charge: 0.191890 -0.265767 0.485946 -0.304442 -0.144103 -0.113140 0.323128 -0.108345 -0.097639 -0.161753 0.076068 -0.005892 -0.028443 0.013397 -0.012247 0.151340
polarizability: 3.02594330e+02 -8.63078375e+00 1.27103664e+02 -5.90625860e-01 2.46331225e+00 1.15485480e+02
1716.lowfreq: -5.9754 -0.0011 0.0019 0.0022 3.1970 6.3056 14.8257 29.3987 40.5094
frequency: 13.4418 28.9999 40.4848 57.9813 94.5855 121.7165 166.2556 177.4534 222.3996 237.7082 281.1509 336.9066 356.6858 401.0616 402.2952 413.3111 438.7943 469.6677 509.5104 529.4034 611.6343 632.7699 655.7165 673.8814 693.1972 714.3259 740.9784 746.5981 814.3918 820.4979 833.9524 842.6780 893.3971 902.3036 941.1201 963.4776 965.8749 983.5762 986.0889 987.9703 1003.4672 1019.4818 1072.6357 1082.3138 1097.4668 1113.7527 1139.5812 1157.4018 1172.1734 1179.8405 1192.1584 1220.8374 1235.1267 1241.7135 1306.1143 1312.3253 1374.6388 1385.8586 1420.7104 1427.9502 1437.9650 1459.2901 1466.9160 1468.3941 1473.3605 1503.7523 1582.1184 1584.8310 1594.2358 1623.7157 2960.3330 3016.1405 3048.3426 3091.4465 3124.1538 3125.9862 3128.3465 3130.5582 3133.4480 3144.5370 3157.9623 3164.4927 3168.6341 3169.6974
redmass: 4.6737 4.7190 5.2695 4.4479 3.8799 5.4997 4.2308 4.8136 2.9350 1.2534 4.1308 2.6236 5.7263 4.5047 3.9394 2.9406 5.3912 3.1886 3.3211 3.7151 6.3941 6.6911 4.7980 6.7789 2.1696 4.5020 1.5413 3.9163 1.6028 2.6433 1.2577 1.7852 1.3943 1.4292 1.3805 1.3579 1.3766 6.2649 1.3059 8.6988 2.6603 3.2624 2.5640 1.6207 1.3049 1.2598 1.0968 1.3176 1.0500 1.2168 1.1266 1.9157 3.3691 1.5411 1.2964 1.3415 6.5908 5.1478 3.5144 2.2297 1.1719 1.2909 1.6103 1.0504 1.0754 2.5374 5.9991 7.0207 5.9384 6.4413 1.0330 1.0565 1.1039 1.1090 1.0846 1.0982 1.0907 1.0880 1.0895 1.0934 1.0948 1.0940 1.1001 1.0958
irintensity: 0.4063 0.7102 0.2763 0.7900 3.1840 1.3030 4.2966 0.0936 3.8934 0.2485 0.1893 1.7654 2.8337 0.2068 0.0275 0.0111 7.3795 11.5590 18.5166 25.6149 0.9311 0.4394 30.0034 25.5370 32.6193 2.5524 81.3421 8.0806 13.4857 5.0031 0.1361 57.5035 2.5400 0.2633 0.1122 0.2113 0.1099 2.6473 0.0857 45.5917 9.8486 33.7966 43.2791 8.8381 9.7370 0.2440 5.8597 2.4289 0.3464 84.9803 1.0329 34.5408 150.7955 57.8247 0.6075 2.5222 3.3066 9.0608 2.9485 7.7185 10.7789 41.7984 34.1755 14.2211 55.6959 115.6603 7.9774 11.7927 75.5343 83.0503 72.7151 17.9095 48.2899 7.5617 4.5966 34.9966 4.0753 2.3787 13.4405 21.4513 39.9703 15.1875 16.5936 4.1013
temp: 298.150 k
press: 1.00000 atm
elementType: 16 8 6 6 6 6 6 6 6 6 6 6 6 6 6 6 1 1 1 1 1 1 1 1 1 1 1 1 1 1
symmnumber: 1
zpe: 625757.3 jmol-1
zpe.correction: 0.238338 hartree
zpe.thermalcorrener: 0.253365 hartree
zpe.thermalcorrenthalpy: 0.254309 hartree
zpe.thermalcorrgfe: 0.193221 hartree
zpe.sumelectzpe: -1014.008656 hartree
zpe.sumelectthermal: -1013.993630 hartree
zpe.sumelectthermalent: -1013.992685 hartree
zpe.sumelectthermalfe: -1014.053774 hartree
dipole: -1.3244 -0.9120 -1.7763
dipole: 2.3961
quadrupole: -82.0528 -99.2804 -100.4594
quadrupole: -4.5444 9.0407 -0.3346
quadrupole: 11.8780 -5.3495 -6.5285 -4.5444 9.0407 -0.3346
hfenergy: -1014.2469944 hartree
pointgroup: C01 [X(C14H14O1S1)]
dipole: 0.502795 0.7968401 0.0300437 debye
polarizability: 302.8581741|-0.1666846|119.4444565|-5.3963413|5.887714|122.8808434 unknown
InChI: InChI=1S/C14H14OS/c1-15-13-9-7-12(8-10-13)11-16-14-5-3-2-4-6-14/h2-10H,11H2,1H3
charge 0 multiplicity 1
30 atoms
S  -1.184413 -0.580139 -0.685233
O  5.396891 -0.366259 0.131023
C  1.212766 0.238456 0.514132
C  -0.275847 0.417428 0.674513
C  1.970473 1.12458 -0.288515
C  1.891102 -0.832239 1.158735
C  4.020725 -0.105952 0.207507
C  3.365249 0.96609 -0.448116
C  3.277918 -1.006569 1.013061
C  -2.951653 -0.251172 -0.304499
C  -3.39647 0.570179 0.760521
C  -3.904987 -0.875173 -1.152208
C  -4.781851 0.762585 0.971461
C  -5.284441 -0.676772 -0.933571
C  -5.732405 0.143575 0.129837
C  6.211304 0.528308 -0.695117
H  -0.63075 0.035317 1.646188
H  -0.576692 1.471878 0.557283
H  1.464787 1.951415 -0.801549
H  1.322651 -1.536199 1.777777
H  3.919468 1.671807 -1.073801
H  3.807448 -1.825922 1.508324
H  -2.685081 1.063358 1.429657
H  -3.568231 -1.512484 -1.977966
H  -5.11335 1.400186 1.799089
H  -6.00856 -1.164807 -1.595671
H  -6.803854 0.295995 0.297952
H  6.175668 1.569035 -0.318007
H  5.887146 0.505557 -1.753795
H  7.23689 0.139738 -0.613314
