program: Gaussian 09
title: 000262752
version: EM64L-G09RevD.01
frameworkgroup: C1[X(C14H13NO2S)]
method: RPBEPBE
basis: SDD
operation: Freq
keyword: #p
keyword: freq=noraman
keyword: PBEPBE/SDD
title: #p freq=noraman PBEPBE/SDD
converged: YES YES NO NO
title: Mulliken charges:
elementType: S O O N C C C C C C C C C C C C C C H H H H H H H H H H H H H
charge: -0.016429 -0.292713 -0.287305 -0.444326 0.470941 -0.475278 0.542732 -0.366358 -0.385693 -0.499554 -0.332872 -0.227943 -0.226066 -0.182963 0.279962 -0.215857 -0.232584 -0.249192 0.244090 0.224451 0.269328 0.233539 0.338336 0.303139 0.228705 0.227590 0.254524 0.230842 0.230005 0.233567 0.123381
chargesum: 0.00000
title: Mulliken charges with hydrogens summed into heavy atoms:
elementType: S O O N C C C C C C C C C C C C C C
charge: 0.106952 -0.292713 -0.287305 -0.105990 0.470941 -0.006738 0.542732 -0.097031 -0.152154 -0.499554 -0.029733 0.000763 0.001525 0.071562 0.279962 0.014985 -0.002580 -0.015625
polarizability: 2.33081275e+02 2.03082003e+01 1.86338848e+02 1.14517487e+00 5.34564509e+00 1.23861486e+02
1716.lowfreq: -3.0385 -2.1860 0.0009 0.0012 0.0021 9.4446 18.3864 22.0559 34.1885
frequency: 18.2167 21.8644 33.7004 70.5814 85.6333 103.6037 145.2162 165.5471 194.9879 199.5703 249.8068 266.7622 283.8279 330.3495 373.3638 400.9786 404.0765 422.9664 439.7739 489.4144 536.4100 577.8661 612.4060 618.2843 665.1287 681.9389 687.9245 704.4147 716.7294 758.3127 762.9837 782.0311 815.9079 827.7973 858.5874 861.1877 881.9196 892.0448 934.9682 958.4249 965.4328 981.9109 987.8838 991.9580 997.5734 1000.6207 1018.6967 1027.6262 1046.6911 1090.8519 1126.9148 1167.3232 1173.1483 1173.7074 1189.0627 1222.1914 1240.5220 1240.9494 1304.8620 1330.5018 1347.5476 1370.6852 1385.9763 1431.8108 1442.5410 1447.3764 1462.0543 1485.4350 1513.7915 1582.8329 1594.8472 1604.9723 1615.1324 1652.6267 2393.6036 3037.1202 3111.0054 3120.2891 3128.4477 3136.5721 3140.3964 3151.1475 3151.3795 3165.2440 3169.8660 3187.0300 3432.8849
redmass: 4.5583 6.2725 4.7968 7.6178 5.4701 5.3069 5.0406 5.2709 4.9623 1.3190 6.4460 7.2606 3.8785 3.5788 4.0963 3.8055 2.8661 7.2803 3.1648 4.2886 3.3496 5.3100 5.1400 6.0587 6.2901 6.7062 6.8773 1.8006 2.8521 2.1420 1.2031 1.3318 3.5034 5.1342 1.2464 1.2075 5.2665 1.4552 1.4869 1.3651 2.5007 1.4974 3.4369 4.8671 1.3160 1.3351 5.6610 2.2144 2.0917 1.5158 1.6307 3.0609 1.0666 1.0554 1.1233 2.8697 1.6268 1.1587 1.7105 1.2574 1.3000 5.7380 8.0145 2.5468 2.1776 2.2695 1.1346 2.2966 2.5400 5.1703 6.0994 6.4736 6.0814 8.2209 1.0387 1.0587 1.1073 1.0866 1.0874 1.0863 1.0920 1.0914 1.0964 1.1016 1.0983 1.0957 1.0760
irintensity: 0.0539 0.2443 0.2422 2.3149 4.4771 1.3749 1.6994 0.4252 11.0389 14.2158 10.6022 5.7593 6.6566 1.8432 12.8864 2.1887 0.0542 0.5007 8.0216 13.6255 6.7725 15.6631 4.5770 0.8517 7.7329 0.6782 2.2557 57.6606 16.9963 73.2916 33.9069 135.8470 8.1782 18.4344 0.1205 3.3053 11.2474 14.5573 11.4412 3.4945 87.6892 14.2054 132.8717 94.9874 1.9875 0.6547 52.0780 2.9141 7.5513 9.3592 22.8743 397.4242 0.4721 1.1776 0.3798 27.5542 22.3505 9.1880 22.7679 3.2475 16.9990 112.1432 0.6966 125.6764 9.0165 6.9241 28.4652 8.9313 641.7959 46.6518 2.4266 137.9376 0.1904 207.3932 24.3338 36.9325 5.2016 5.3047 1.9006 3.6804 18.1011 12.1235 26.4118 22.3740 16.0368 9.3000 107.3878
temp: 298.150 k
press: 1.00000 atm
elementType: 16 8 8 7 6 6 6 6 6 6 6 6 6 6 6 6 6 6 1 1 1 1 1 1 1 1 1 1 1 1 1
symmnumber: 1
zpe: 618329.1 jmol-1
zpe.correction: 0.235509 hartree
zpe.thermalcorrener: 0.251796 hartree
zpe.thermalcorrenthalpy: 0.252740 hartree
zpe.thermalcorrgfe: 0.188702 hartree
zpe.sumelectzpe: -1143.283646 hartree
zpe.sumelectthermal: -1143.267359 hartree
zpe.sumelectthermalent: -1143.266415 hartree
zpe.sumelectthermalfe: -1143.330453 hartree
dipole: 0.6422 0.7365 -1.4245
dipole: 1.7274
quadrupole: -99.5808 -108.5140 -109.0755
quadrupole: 7.3819 2.7765 0.5504
quadrupole: 6.1426 -2.7905 -3.3521 7.3819 2.7765 0.5504
hfenergy: -1143.5191555 hartree
pointgroup: C01 [X(C14H13N1O2S1)]
dipole: 0.2728712 -0.6072406 0.1367172 debye
polarizability: 235.2048036|-9.2125284|142.389945|-15.0385211|28.3279721|165.68686 unknown
InChI: InChI=1S/C14H13NO2S/c16-14(15-12-8-4-5-9-13(12)18)17-10-11-6-2-1-3-7-11/h1-9,15,18H,10H2
charge 0 multiplicity 1
31 atoms
S  -3.081247 -1.969698 -2.040905
O  0.889789 0.60629 -1.486171
O  0.029086 1.725701 0.405083
N  -1.209173 0.119492 -0.828211
C  3.149525 0.480365 -0.435786
C  2.206219 1.304865 -1.284645
C  -2.456612 0.09614 -0.163824
C  3.131732 0.598337 0.978662
C  4.062323 -0.418689 -1.043188
C  -3.439004 -0.842525 -0.605032
C  -2.774885 0.966806 0.914715
C  4.010402 -0.174711 1.769275
C  4.942264 -1.191884 -0.253286
C  -4.711744 -0.883993 -0.00189
C  -0.102173 0.895906 -0.53172
C  -4.047046 0.902593 1.518204
C  4.917879 -1.070443 1.155766
C  -5.024153 -0.013659 1.066739
H  1.997618 2.287595 -0.827991
H  2.578053 1.427245 -2.313936
H  2.419768 1.287063 1.447498
H  4.081158 -0.513697 -2.136019
H  -1.126625 -0.503947 -1.642311
H  -2.019451 1.676193 1.258853
H  3.990479 -0.077378 2.860476
H  5.645244 -1.882538 -0.732321
H  -5.45022 -1.601547 -0.372698
H  -4.275698 1.581661 2.347061
H  5.601613 -1.667147 1.770199
H  -6.012983 -0.052672 1.534547
H  -2.483739 -2.989324 -1.307946
