program: Gaussian 09
title: 000262751
version: EM64L-G09RevD.01
frameworkgroup: C1[X(C13H19NO2)]
method: RPBEPBE
basis: SDD
operation: Freq
keyword: #p
keyword: freq=noraman
keyword: PBEPBE/SDD
title: #p freq=noraman PBEPBE/SDD
converged: YES YES NO NO
title: Mulliken charges:
elementType: O O N C C C C C C C C C C C C C H H H H H H H H H H H H H H H H H H H
charge: -0.282521 -0.275360 -0.577517 0.328668 -0.233533 -0.603488 -0.708865 -0.704848 -0.714106 0.300332 0.510756 -0.405361 -0.399007 -0.234350 -0.228239 -0.246187 0.259623 0.210062 0.226054 0.225484 0.209689 0.264477 0.234983 0.228903 0.201652 0.258605 0.207557 0.240172 0.271288 0.290136 0.240379 0.227742 0.226444 0.223067 0.227310
chargesum: 0.00000
title: Mulliken charges with hydrogens summed into heavy atoms:
elementType: O O N C C C C C C C C C C C C C
charge: -0.282521 -0.275360 -0.016094 0.328668 0.026090 -0.167372 -0.009216 -0.039309 -0.007772 0.300332 0.510756 -0.164982 -0.171265 -0.007906 -0.005171 -0.018877
polarizability: 1.43693422e+02 -1.66805071e+01 1.66395541e+02 -1.30688480e+01 -4.44221798e+00 1.34893498e+02
1716.lowfreq: -13.0889 -12.1468 -0.0006 -0.0004 0.0003 5.5620 11.4220 28.7091 46.2972
frequency: -8.8514 28.6703 46.2459 67.4340 85.3249 117.4536 139.1937 170.6568 178.9690 230.7339 239.2794 246.2375 254.1691 288.9406 298.5533 306.3660 340.1815 347.4194 362.3483 403.7739 407.2849 445.0666 465.2479 502.5451 573.1316 600.1682 617.8870 657.2303 703.3999 705.5897 719.9924 756.4070 803.6148 818.5574 840.5138 852.5690 912.7071 917.9120 923.8465 947.9648 955.4060 974.3885 985.0901 989.7320 994.0007 1026.9463 1028.8711 1035.8666 1075.4581 1094.3066 1127.0262 1135.0585 1171.0914 1175.9826 1187.5657 1205.7639 1216.7174 1257.9992 1271.1592 1285.6951 1313.7280 1330.9984 1374.6741 1377.8065 1380.3827 1387.3125 1401.7647 1440.5240 1444.7154 1464.4122 1466.3727 1468.6993 1469.2073 1479.3517 1483.1813 1502.1040 1591.8821 1596.0358 1613.5110 1641.4176 2983.9560 2989.4615 2990.2832 2995.5729 3040.7603 3059.2019 3082.1576 3084.4882 3095.9105 3099.5627 3111.2349 3113.2287 3116.3417 3116.8761 3130.7061 3141.8160 3160.6585 3459.1853 3594.9699
redmass: 3.9678 3.7200 3.9834 4.1487 3.9433 3.8237 3.2850 4.3276 1.0723 1.8692 1.2245 1.1610 1.5797 2.2606 3.2701 3.6302 2.6119 2.4528 2.4979 2.8091 2.6468 3.1627 2.8528 2.6729 1.9669 2.8097 6.2966 3.0860 2.2107 3.8281 4.8238 2.0325 3.3538 3.9675 3.6888 1.2576 1.5082 1.5904 1.6331 1.7987 1.2042 1.3910 3.4085 5.8673 1.5134 2.1911 1.4244 1.4171 1.5593 2.1726 2.8213 1.3361 1.0741 1.4916 1.1288 2.1394 2.7434 3.0131 3.0761 1.4040 1.2364 1.2290 1.2398 2.0159 1.6362 2.3811 1.2156 2.1250 1.0507 1.1215 1.0546 1.0616 1.0602 1.0544 2.3053 1.0559 5.8371 2.1947 6.1374 1.7631 1.0604 1.0363 1.0357 1.0365 1.0930 1.0955 1.0991 1.0991 1.0990 1.1006 1.0873 1.1004 1.0900 1.0959 1.0909 1.0959 1.1014 1.0443 1.0985
irintensity: 1.3454 0.1180 0.0779 3.6724 0.8534 1.1236 3.7178 2.2084 0.1215 9.3609 3.3068 10.1711 33.4669 18.2342 7.7941 7.9375 0.1313 3.6283 4.5097 0.0622 2.1488 0.8185 3.2897 5.2816 204.7990 141.1137 0.3318 8.9123 33.3404 46.2318 5.6687 25.1382 7.6541 6.4662 7.2106 0.4635 0.3190 1.0788 0.8911 5.5576 0.2759 0.1607 36.0282 0.0829 10.1851 5.4750 0.2483 0.5193 10.6657 38.3791 334.2521 27.6121 3.8721 39.4980 0.6870 15.4178 3.1934 29.8652 14.4169 4.6503 5.6835 0.8664 38.3972 21.4604 26.1258 8.9763 19.1669 6.2567 0.4984 15.6762 6.3953 5.1244 8.3060 4.0382 19.5023 28.6614 6.8723 185.2545 7.7732 21.2625 39.6430 18.6790 11.2972 28.0918 4.2294 22.6695 7.7952 13.4099 56.0823 25.3122 9.6772 5.0266 2.5237 17.2963 10.3810 42.7528 22.7722 7.3918 5.3888
temp: 298.150 k
press: 1.00000 atm
elementType: 8 8 7 6 6 6 6 6 6 6 6 6 6 6 6 6 1 1 1 1 1 1 1 1 1 1 1 1 1 1 1 1 1 1 1
symmnumber: 1
zpe: 772262.2 jmol-1
zpe.correction: 0.294139 hartree
zpe.thermalcorrener: 0.310670 hartree
zpe.thermalcorrenthalpy: 0.311615 hartree
zpe.thermalcorrgfe: 0.250283 hartree
zpe.sumelectzpe: -710.763640 hartree
zpe.sumelectthermal: -710.747109 hartree
zpe.sumelectthermalent: -710.746165 hartree
zpe.sumelectthermalfe: -710.807497 hartree
dipole: 0.7404 -0.8870 -0.8475
dipole: 1.4328
quadrupole: -97.5203 -84.9408 -96.2234
quadrupole: 5.7586 -1.9363 -2.3873
quadrupole: -4.6255 7.9541 -3.3285 5.7586 -1.9363 -2.3873
hfenergy: -711.0577791 hartree
pointgroup: C01 [X(C13H19N1O2)]
dipole: 0.3330265 0.3381461 0.3041924 debye
polarizability: 147.1237465|16.5142074|165.6779633|11.8576442|-6.1678738|132.1807502 unknown
InChI: InChI=1S/C13H19NO2/c1-13(2,3)16-12(15)11(14)9-10-7-5-4-6-8-10/h4-8,11H,9,14H2,1-3H3
charge 0 multiplicity 1
35 atoms
O  -1.374593 0.106052 0.726793
O  -1.89146 -1.133434 -1.200242
N  -1.006031 -3.307688 0.45564
C  -2.292875 1.293202 0.398984
C  -0.290681 -2.021893 0.433974
C  1.013222 -2.033568 -0.45431
C  -3.751238 0.796916 0.360284
C  -2.037082 2.225373 1.594416
C  -1.843169 1.933829 -0.92853
C  -1.275732 -0.981383 -0.114092
C  1.795012 -0.730967 -0.432739
C  1.68952 0.201456 -1.497096
C  2.623066 -0.4023 0.672857
C  2.39039 1.42838 -1.458966
C  3.32317 0.823522 0.717091
C  3.209226 1.745121 -0.350364
H  -0.019267 -1.73498 1.464217
H  1.63872 -2.86454 -0.072422
H  0.70665 -2.292948 -1.485242
H  -4.009974 0.281213 1.301798
H  -4.428123 1.663178 0.243149
H  -3.912981 0.106489 -0.482315
H  -0.972948 2.51372 1.639601
H  -2.303409 1.724879 2.541126
H  -2.64799 3.140581 1.49468
H  -2.038011 1.26254 -1.779414
H  -2.401537 2.875375 -1.084493
H  -0.765251 2.170706 -0.896394
H  -0.467832 -4.089951 0.837398
H  -1.471939 -3.525294 -0.431546
H  1.056063 -0.038679 -2.360204
H  2.724419 -1.115216 1.50143
H  2.303282 2.132152 -2.294913
H  3.960561 1.05832 1.577384
H  3.756624 2.694038 -0.320936
