program: Gaussian 09
title: 000262977
version: EM64L-G09RevD.01
frameworkgroup: C1[X(C24H27NO7)]
method: RPBEPBE
basis: SDD
operation: Freq
keyword: #p
keyword: freq=noraman
keyword: PBEPBE/SDD
title: #p freq=noraman PBEPBE/SDD
converged: YES YES NO NO
title: Mulliken charges:
elementType: O O O O O O O N C C C C C C C C C C C C C C C C C C C C C C C C H H H H H H H H H H H H H H H H H H H H H H H H H H H
charge: -0.260378 -0.325964 -0.352997 -0.130097 -0.150468 -0.188223 -0.244135 -0.460128 0.298595 0.167179 0.140182 0.080725 0.030944 0.114162 0.231854 0.359013 -0.153242 -0.356760 -0.142646 -0.424038 -0.791790 0.153699 -0.783705 0.195712 -0.383695 -0.363780 -0.255219 -0.282683 -0.346155 -0.344106 -0.683958 -0.686140 0.456709 0.279226 0.249961 0.236730 0.234003 0.275347 0.227474 0.248220 0.247296 0.203640 0.221688 0.216675 0.214294 0.249341 0.209657 0.258035 0.218572 0.187241 0.205734 0.189987 0.204604 0.216312 0.221546 0.209749 0.214606 0.221272 0.220326
chargesum: 0.00000
title: Mulliken charges with hydrogens summed into heavy atoms:
elementType: O O O O O O O N C C C C C C C C C C C C C C C C C C C C C C C C
charge: -0.260378 -0.325964 -0.352997 -0.130097 -0.150468 -0.188223 -0.244135 -0.003419 0.298595 0.167179 0.140182 0.080725 0.030944 0.114162 0.231854 0.359013 -0.153242 -0.077534 -0.142646 -0.174078 -0.045710 0.153699 -0.060715 0.195712 0.041633 0.067189 0.203779 0.193924 0.046820 0.050485 -0.036351 -0.029936
polarizability: 3.92147791e+02 1.42504090e+01 4.45735567e+02 -2.78610051e+00 3.19626593e+01 1.86769412e+02
1716.lowfreq: -10.1486 -2.8433 -0.0006 -0.0005 -0.0003 4.7730 6.2075 18.0156 23.4441
frequency: -8.4674 17.9650 23.4360 30.9380 35.9747 36.3635 51.8725 55.7936 61.0368 67.4600 72.8536 77.5491 94.2109 95.7203 101.8479 112.4958 115.7027 128.3335 150.0307 159.2697 174.0383 187.2378 202.4876 210.2712 218.1023 226.1093 228.1430 236.6776 248.6981 258.6757 287.6110 288.8293 302.7831 311.8537 321.0414 348.3344 354.8345 372.3433 382.7554 411.6709 414.8974 417.3369 446.4982 457.6415 470.1741 507.5465 534.2625 547.6675 564.1071 571.6213 573.7623 615.4614 629.7240 666.3894 689.9501 691.3163 696.8497 726.0745 738.3498 740.9254 745.4451 753.1688 767.6952 798.9587 807.7483 831.9222 840.2289 854.4124 872.8114 883.4688 902.2359 905.2535 915.5601 929.1594 932.3835 939.3266 953.4617 976.6116 980.7213 996.6575 1033.0330 1036.2656 1038.8281 1044.1545 1057.2540 1075.7464 1077.6880 1080.8896 1092.3844 1106.7325 1115.8878 1121.3123 1149.0362 1156.9318 1163.5728 1191.2387 1210.7859 1223.6904 1233.0160 1249.8388 1263.1030 1266.7426 1271.2531 1272.5343 1282.7511 1287.7879 1290.8299 1296.0934 1313.2764 1340.0652 1343.8058 1360.7552 1366.2693 1372.6419 1390.1958 1391.4651 1393.9201 1400.5756 1404.5271 1423.9167 1437.0886 1458.3407 1461.5040 1464.0403 1469.7947 1471.4696 1472.4582 1473.8536 1476.2666 1476.6786 1478.1857 1480.6474 1485.9008 1489.8091 1495.2683 1503.9612 1528.2223 1560.5152 1568.9710 1585.0525 1611.7354 1623.7343 1640.4005 1650.2377 2963.7944 2965.4050 2977.8523 2979.4175 2985.4729 2987.7912 2988.6620 2989.0445 2999.6345 3011.4432 3011.9000 3034.9550 3044.5609 3047.8549 3061.6541 3066.3696 3071.6909 3076.8896 3077.9849 3079.8937 3080.8003 3104.3356 3107.1851 3111.0575 3151.8659 3174.9003 3318.0791
redmass: 3.7840 4.6405 4.2414 5.1561 6.5322 5.2129 4.8169 1.6793 2.6670 2.8358 1.7928 1.7678 3.1599 2.9385 2.1958 2.1726 2.2718 3.5497 2.3940 4.2143 3.3687 3.8654 4.0009 4.5000 3.9496 1.2332 3.7733 1.3036 4.3932 4.2456 4.2047 4.8952 4.8925 5.3533 5.3596 7.0119 7.4845 9.2066 5.1917 3.2197 3.1818 5.9729 6.8004 6.7302 8.1552 8.3964 5.0870 5.3591 5.0644 6.0609 7.6996 6.5749 7.0369 9.3364 8.2492 5.6869 7.5578 5.4149 1.0894 1.1530 4.3519 3.5895 5.6455 1.1816 1.3285 5.7212 1.3727 5.7588 2.6729 2.0641 1.8590 1.9044 4.3638 5.1226 1.1905 1.6392 2.8990 1.7464 1.3505 4.8282 3.6199 1.5042 3.4309 1.5413 4.1047 2.6068 2.5218 2.4354 4.8122 2.7299 2.4900 2.5475 1.5285 4.6043 1.7528 1.9616 1.3464 1.3236 3.5681 2.7780 3.2977 1.3095 1.3886 1.2583 1.1517 1.0884 1.0753 2.5109 6.1247 1.3960 1.4133 1.5134 1.5546 4.5323 1.2477 1.2085 1.2177 2.3024 1.6650 3.9655 3.0042 1.0447 1.1339 1.0950 1.0679 1.0471 1.0648 1.2384 1.0513 1.0583 1.0447 1.0682 1.0755 1.0921 1.0920 3.2752 11.8158 8.9018 7.3435 4.7896 7.8400 8.6028 7.7002 11.2181 1.0609 1.0598 1.0362 1.0362 1.0372 1.0602 1.0613 1.0374 1.0609 1.0990 1.0962 1.0568 1.1009 1.1035 1.0969 1.0966 1.1027 1.1010 1.1033 1.1000 1.0996 1.1000 1.1081 1.0990 1.0890 1.0962 1.0793
irintensity: 0.1775 0.2487 0.6404 3.3595 0.1101 1.5767 0.1643 0.0693 0.1891 0.2174 0.1508 0.0677 0.1323 0.3741 0.0946 0.7828 0.5107 1.0630 0.0727 1.4708 0.3920 0.2797 11.5975 1.3304 1.3483 0.6569 4.0348 0.5726 7.0954 3.4627 0.8982 1.4253 2.9281 0.9709 1.7202 9.8551 5.8946 4.9213 2.2178 4.9306 3.3020 3.3723 4.9041 1.3642 6.2488 1.1386 0.3342 0.3369 0.5654 2.1117 1.6342 1.8488 8.4903 2.7017 9.6613 5.6252 7.6277 1.0814 14.3901 6.0966 7.0977 7.6683 10.9585 1.0094 1.6976 5.9987 28.8139 6.0586 55.5672 40.0002 1.5539 13.9608 15.9382 8.8274 0.5700 66.2259 125.4424 24.7485 2.1919 34.4517 19.4548 0.5465 33.8496 7.5750 70.6248 66.0080 36.1430 45.5195 308.9298 62.5322 3.2733 2.2170 4.5760 24.0206 3.1897 51.4949 0.2532 0.5525 56.7510 146.4154 192.7834 8.5279 49.4781 12.5996 0.2160 0.5444 1.2807 30.2027 33.1986 8.0037 5.6442 27.6858 3.2807 176.6635 27.0091 10.7179 5.9054 125.8027 87.0607 4.8263 76.7718 13.8157 74.9942 8.0299 0.3464 20.4181 0.2786 14.9009 5.5737 12.2478 10.2574 6.4995 5.3135 26.4267 14.2358 2.2693 471.0586 47.9638 54.0821 361.5771 349.6871 59.1055 196.4779 81.9094 28.0632 34.9882 30.9001 27.1575 12.6695 16.6710 16.7151 15.1739 44.0208 5.8167 13.6484 41.2620 8.0172 18.7279 15.6332 8.7376 3.5557 58.4291 100.6427 45.5666 53.2453 20.6390 20.0431 3.0066 7.2030 5.1714 343.7913
temp: 298.150 k
press: 1.00000 atm
elementType: 8 8 8 8 8 8 8 7 6 6 6 6 6 6 6 6 6 6 6 6 6 6 6 6 6 6 6 6 6 6 6 6 1 1 1 1 1 1 1 1 1 1 1 1 1 1 1 1 1 1 1 1 1 1 1 1 1 1 1
symmnumber: 1
zpe: 1222431.4 jmol-1
zpe.correction: 0.465600 hartree
zpe.thermalcorrener: 0.497907 hartree
zpe.thermalcorrenthalpy: 0.498852 hartree
zpe.thermalcorrgfe: 0.399229 hartree
zpe.sumelectzpe: -1509.727274 hartree
zpe.sumelectthermal: -1509.694966 hartree
zpe.sumelectthermalent: -1509.694022 hartree
zpe.sumelectthermalfe: -1509.793644 hartree
dipole: 2.3576 8.8382 2.1510
dipole: 9.3968
quadrupole: -165.1988 -229.9923 -186.2963
quadrupole: -33.9592 -3.3718 -10.7787
quadrupole: 28.6303 -36.1632 7.5328 -33.9592 -3.3718 -10.7787
hfenergy: -1510.1928736 hartree
pointgroup: C01 [X(C24H27N1O7)]
dipole: -1.2040574 -3.3617428 0.9573815 debye
polarizability: 394.8738554|17.9605192|440.9961482|-3.5970573|-39.3373861|188.7827663 unknown
InChI: InChI=1S/C24H27NO7/c1-5-7-11-30-23(28)15-10-9-13(3)21-17(15)25-18-16(24(29)31-12-8-6-2)20(27)19(26)14(4)22(18)32-21/h9-10,25H,5-8,11-12H2,1-4H3
charge 0 multiplicity 1
59 atoms
O  3.204531 -1.038729 0.155328
O  -1.231764 1.691148 0.545716
O  -1.98815 -1.435964 -0.103927
O  1.703509 4.245504 -0.587929
O  4.375855 3.468273 -0.814686
O  -0.934047 3.227661 -1.188077
O  -2.323547 -3.739017 0.076957
N  0.488772 -0.424119 0.028467
C  1.379885 0.625393 -0.135492
C  0.862253 -1.768176 0.17668
C  2.817227 0.28672 -0.110352
C  2.247818 -2.068633 0.267855
C  0.980003 1.95057 -0.354327
C  -0.067065 -2.856456 0.251452
C  3.837279 1.18638 -0.31638
C  2.759497 -3.367977 0.471473
C  1.992893 3.016167 -0.520507
C  0.438896 -4.166658 0.456771
C  3.488833 2.597284 -0.57201
C  1.816678 -4.419481 0.573858
C  5.288483 0.774674 -0.293945
C  -0.446611 2.369898 -0.42487
C  4.250093 -3.598125 0.570429
C  -1.542678 -2.757896 0.078946
C  -3.13309 1.698397 2.067668
C  -3.585138 -0.74711 -1.869794
C  -2.632321 2.187139 0.707848
C  -3.440232 -1.240674 -0.426327
C  -4.613681 2.08168 2.307009
C  -5.053105 -0.379184 -2.196899
C  -5.127312 1.604416 3.682094
C  -5.218143 0.126501 -3.64603
H  -0.525108 -0.21669 0.068752
H  -0.288611 -4.981925 0.508589
H  2.173954 -5.441277 0.734377
H  5.575921 0.379547 0.69801
H  5.491467 -0.025437 -1.028987
H  5.916923 1.648276 -0.527146
H  4.473443 -4.666118 0.724073
H  4.687729 -3.023239 1.406863
H  4.76758 -3.257967 -0.345083
H  -3.015335 0.599097 2.137328
H  -2.499427 2.134547 2.862927
H  -3.233051 -1.533011 -2.565214
H  -2.939319 0.138916 -2.027299
H  -2.619502 3.289532 0.636795
H  -3.240879 1.801816 -0.132576
H  -3.95898 -2.200102 -0.259559
H  -3.797218 -0.493029 0.300915
H  -5.244889 1.64623 1.504283
H  -4.728246 3.181482 2.22997
H  -5.403624 0.402489 -1.491286
H  -5.702685 -1.262718 -2.034685
H  -4.539975 2.05653 4.502761
H  -6.186445 1.88059 3.832833
H  -5.046414 0.505259 3.777483
H  -4.909831 -0.647008 -4.373647
H  -6.269105 0.391872 -3.859818
H  -4.598397 1.024333 -3.826059
