program: Gaussian 09
title: 000262764
version: EM64L-G09RevD.01
frameworkgroup: C1[X(C21H21NS)]
method: RPBEPBE
basis: SDD
operation: Freq
keyword: #p
keyword: freq=noraman
keyword: PBEPBE/SDD
title: #p freq=noraman PBEPBE/SDD
converged: YES YES NO NO
title: Mulliken charges:
elementType: S N C C C C C C C C C C C C C C C C C C C C C H H H H H H H H H H H H H H H H H H H H H
charge: 0.154071 -0.550233 -0.600635 0.486834 0.488241 0.413951 -0.641124 -0.356915 -0.352603 -0.401134 -0.393327 -0.406013 -0.355441 -0.363423 -0.250374 -0.238545 -0.265165 -0.245232 -0.253676 -0.254495 -0.246397 -0.245677 -0.245764 0.244485 0.274444 0.249915 0.247454 0.268671 0.252893 0.260616 0.274879 0.248663 0.219479 0.227249 0.224224 0.227004 0.224649 0.226033 0.229879 0.227961 0.228111 0.230351 0.271734 0.264384
chargesum: 0.00000
title: Mulliken charges with hydrogens summed into heavy atoms:
elementType: S N C C C C C C C C C C C C C C C C C C C C C
charge: 0.154071 -0.014115 -0.600635 0.486834 0.488241 0.413951 -0.122194 -0.107000 -0.105149 -0.132463 -0.140434 -0.145397 -0.080562 0.104719 -0.023125 -0.014322 -0.038162 -0.020583 -0.027643 -0.024616 -0.018436 -0.017567 -0.015412
polarizability: 2.63996315e+02 6.47946759e+00 2.51124849e+02 1.21343309e+01 -1.04663443e+01 2.22319882e+02
1716.lowfreq: -12.5082 -9.7424 -0.0007 0.0015 0.0022 8.2825 19.2904 42.4499 48.8960
frequency: 19.0160 42.4392 48.8604 49.7638 59.9467 66.7603 84.4042 90.3148 104.0422 132.4651 166.9850 208.4037 223.8429 228.4712 259.8306 263.5293 279.3567 282.3079 282.7077 315.3225 347.6893 380.4075 400.9123 406.1665 412.1481 482.1432 496.7276 525.2578 530.1513 613.0250 613.5855 616.2866 617.8858 626.1301 663.9005 678.4652 704.3123 706.2947 711.6539 726.3380 742.2872 757.0149 775.4935 821.1633 852.4046 859.4179 861.4394 880.1068 885.2407 917.8447 933.8927 938.3899 942.4026 979.5581 984.4914 987.3030 990.1425 990.5758 990.7389 996.1313 997.0474 998.7670 1012.6977 1027.1533 1030.6021 1030.9082 1072.8923 1082.1204 1085.3624 1087.6845 1089.5766 1145.1401 1170.7426 1172.7922 1173.0313 1183.8984 1192.7826 1195.5187 1198.2493 1213.8244 1227.1804 1264.0361 1309.6193 1319.6921 1326.9655 1328.0201 1342.9429 1370.8896 1375.8465 1378.6192 1427.4136 1431.4396 1432.7844 1436.8721 1464.7962 1474.8621 1477.6703 1479.5568 1581.6054 1586.7634 1587.9780 1605.1945 1605.4736 1609.0099 1638.0131 3005.5094 3012.4010 3069.0293 3095.2294 3121.6089 3122.1040 3122.9574 3128.9482 3129.8389 3131.7826 3142.3322 3142.8663 3146.4641 3149.5986 3150.6196 3153.2893 3163.2468 3163.8487 3165.1536 3468.4390 3598.6057
redmass: 4.2581 4.8433 4.1314 4.4992 4.4264 4.3395 4.0233 1.9438 3.4046 4.5276 5.2816 3.3146 5.1493 3.7149 4.3147 4.7216 2.7458 3.0899 1.6438 5.1532 6.4352 4.3913 2.8450 2.8836 2.9209 3.5382 4.0118 3.1919 1.5416 5.9865 6.1470 6.0831 5.8780 6.0877 6.0447 5.4767 1.8903 1.8552 1.7019 1.1790 2.0810 1.7991 2.0385 3.6184 1.2507 1.2482 1.2569 4.1473 3.1436 1.2905 1.4968 1.6000 1.5812 1.3925 1.4816 1.4831 4.9588 4.5405 5.0172 1.3488 1.3136 1.2992 5.3055 2.4765 2.1951 2.1685 1.1003 1.6233 4.0224 1.6113 1.6289 3.1555 1.0717 1.0599 1.0514 3.2899 1.1432 1.1228 1.1281 3.9843 1.2116 1.3249 1.3957 1.3668 1.3120 1.1467 1.2242 5.7465 7.2521 8.6438 2.1064 1.4516 1.6141 2.0945 1.0837 2.1477 2.1368 2.1568 5.8044 6.0884 6.1998 5.9895 5.9782 6.0401 1.0914 1.0605 1.0622 1.1002 1.1063 1.0844 1.0845 1.0847 1.0876 1.0878 1.0880 1.0922 1.0922 1.0921 1.0948 1.0954 1.0952 1.1013 1.1014 1.1010 1.0443 1.0987
irintensity: 0.3716 0.3088 0.1308 0.0532 0.2998 0.1491 0.0534 3.0214 0.6431 0.6041 0.7182 3.9396 0.7550 4.5869 1.2472 0.5709 14.4016 5.6081 25.2248 0.7537 2.8836 13.9754 0.5871 0.2931 0.2776 3.4676 2.1376 15.2475 357.5244 7.7417 1.0238 5.2209 8.2920 10.3698 22.7788 35.5015 31.4916 75.4773 40.8180 32.9510 64.0359 42.4513 22.4929 1.2582 0.3590 0.4246 0.6913 2.4772 1.7920 0.1125 0.0850 0.2844 0.3740 0.1339 0.5988 0.3762 0.7991 0.1829 0.9641 0.2220 0.1668 0.1542 11.9616 1.2281 12.5025 14.9654 0.6109 2.3334 27.3372 2.1515 13.2371 1.7515 0.5412 0.0843 0.0220 1.5900 2.4411 5.3078 2.3285 15.7687 4.4684 1.0298 1.4926 3.7398 0.3340 0.4663 1.3594 0.1059 1.3846 0.5341 3.6496 11.6245 12.2248 11.8411 7.6612 25.8123 8.7484 37.3013 0.8289 1.8772 0.2126 8.3033 8.1614 2.9455 42.3781 10.1104 38.1718 2.7966 24.5383 1.6797 1.8189 1.0905 3.7074 5.7046 6.2671 21.1934 22.3529 22.2551 15.9653 31.2269 15.5803 34.2865 29.9655 12.4398 3.0017 0.8440
temp: 298.150 k
press: 1.00000 atm
elementType: 16 7 6 6 6 6 6 6 6 6 6 6 6 6 6 6 6 6 6 6 6 6 6 1 1 1 1 1 1 1 1 1 1 1 1 1 1 1 1 1 1 1 1 1
symmnumber: 1
zpe: 940158.3 jmol-1
zpe.correction: 0.358087 hartree
zpe.thermalcorrener: 0.379455 hartree
zpe.thermalcorrenthalpy: 0.380399 hartree
zpe.thermalcorrgfe: 0.306507 hartree
zpe.sumelectzpe: -1264.000645 hartree
zpe.sumelectthermal: -1263.979278 hartree
zpe.sumelectthermalent: -1263.978333 hartree
zpe.sumelectthermalfe: -1264.052225 hartree
dipole: 0.0684 1.4887 1.4915
dipole: 2.1084
quadrupole: -140.9652 -131.5651 -137.4391
quadrupole: 7.2775 3.2214 -5.1644
quadrupole: -4.3087 5.0914 -0.7827 7.2775 3.2214 -5.1644
hfenergy: -1264.3587326 hartree
pointgroup: C01 [X(C21H21N1S1)]
dipole: -0.2558399 0.2767736 -0.7389411 debye
polarizability: 264.3055453|3.9155688|255.5348816|9.3841893|5.8778381|217.6006192 unknown
InChI: InChI=1S/C21H21NS/c22-16-17-23-21(18-10-4-1-5-11-18,19-12-6-2-7-13-19)20-14-8-3-9-15-20/h1-15H,16-17,22H2
charge 0 multiplicity 1
44 atoms
S  -0.832187 0.348007 2.079638
N  -4.584656 -1.558518 1.654145
C  0.114291 0.234278 0.358151
C  -0.156947 1.470853 -0.537365
C  1.616421 0.269563 0.737942
C  -0.339606 -1.089829 -0.279384
C  -2.647034 0.065373 1.566215
C  0.48299 1.52917 -1.807363
C  2.08616 1.227161 1.675417
C  -1.209237 -1.127718 -1.398886
C  -0.961023 2.566064 -0.144146
C  2.569421 -0.549602 0.079812
C  0.03628 -2.326227 0.317525
C  -3.177921 -1.318339 2.01844
C  0.31472 2.641968 -2.656063
C  3.461303 1.34159 1.968358
C  -1.675651 -2.359393 -1.918209
C  -1.131285 3.684922 -0.993911
C  3.948224 -0.430076 0.36589
C  -0.418637 -3.553511 -0.202853
C  -0.497889 3.728983 -2.254367
C  4.402151 0.512328 1.314821
C  -1.279749 -3.578323 -1.327733
H  -3.227828 0.885946 2.026157
H  -2.704866 0.169607 0.469411
H  1.126642 0.702485 -2.127977
H  1.369251 1.887137 2.176088
H  -1.518296 -0.193641 -1.87866
H  -1.434755 2.55031 0.842742
H  2.238398 -1.287502 -0.658133
H  0.67165 -2.315878 1.209157
H  -2.55359 -2.110154 1.569909
H  -3.071923 -1.414654 3.115125
H  0.822298 2.664378 -3.627142
H  3.7988 2.082148 2.702292
H  -2.346262 -2.360506 -2.785207
H  -1.756096 4.522809 -0.663799
H  4.665591 -1.074232 -0.155361
H  -0.113111 -4.491317 0.274599
H  -0.626943 4.596821 -2.910781
H  5.470893 0.602435 1.539162
H  -1.638438 -4.532563 -1.729455
H  -4.756202 -1.667733 0.650911
H  -5.26555 -0.94282 2.10729
