program: Gaussian 09
title: 000262748
version: EM64L-G09RevD.01
frameworkgroup: C1[X(C13H10N2O4S2)]
method: RPBEPBE
basis: SDD
operation: Freq
keyword: #p
keyword: freq=noraman
keyword: PBEPBE/SDD
title: #p freq=noraman PBEPBE/SDD
converged: YES YES NO NO
title: Mulliken charges:
elementType: S S O O O O N N C C C C C C C C C C C C C H H H H H H H H H H
charge: 0.125270 0.049633 -0.168279 -0.194793 -0.197384 -0.193482 0.005451 0.022952 -0.406180 0.520838 0.574256 -0.882800 0.420765 -0.460888 -0.148622 -0.368058 -0.356642 -0.369559 -0.219390 -0.217678 -0.233789 0.290259 0.324640 0.327723 0.273183 0.299109 0.257138 0.234835 0.230485 0.229217 0.231789
chargesum: 0.00000
title: Mulliken charges with hydrogens summed into heavy atoms:
elementType: S S O O O O N N C C C C C C C C C C C C C
charge: 0.125270 0.049633 -0.168279 -0.194793 -0.197384 -0.193482 0.005451 0.022952 -0.406180 0.520838 0.574256 -0.267900 0.420765 -0.133165 0.124561 -0.068948 -0.099504 -0.134724 0.011094 0.011539 -0.002000
polarizability: 3.87243925e+02 -2.35167466e+00 1.84059105e+02 1.09564353e+01 1.01199295e+01 1.42116927e+02
1716.lowfreq: -8.6762 -0.9626 -0.0009 0.0003 0.0017 6.6379 16.3601 22.8584 32.7063
frequency: 16.1240 22.7042 32.5753 46.5629 54.3992 56.0345 89.4274 116.8251 132.0007 133.4703 144.3169 162.9168 201.5846 267.1642 278.0479 300.2342 317.9112 340.1862 348.9415 400.4145 404.1632 422.5436 457.0508 477.0207 502.7333 510.8536 552.4814 588.2606 595.8142 616.6950 640.4019 665.1803 693.3385 703.3378 710.5493 737.8691 756.5644 773.0115 806.0908 853.7098 854.8707 868.1676 877.3500 929.7602 951.2655 980.3915 989.1153 993.5504 999.4022 1023.4557 1026.9899 1078.8299 1089.6002 1113.6724 1139.7634 1147.0260 1174.2726 1189.8226 1205.3869 1222.5160 1225.1211 1243.5825 1250.3404 1329.3663 1353.3154 1376.7279 1385.3538 1389.3483 1410.1436 1434.0575 1443.9886 1446.3366 1483.4618 1575.4095 1587.5884 1592.3830 1611.8950 3014.2428 3117.6202 3121.8286 3128.5134 3139.8332 3151.0914 3158.3332 3166.2603 3185.2474 3189.5415
redmass: 7.2596 9.0749 5.0620 9.1177 7.6317 10.0941 8.9905 9.3240 7.7187 6.8664 7.3338 10.1227 12.6956 9.4562 6.4685 9.1916 14.5260 2.0582 9.5782 10.6255 2.8430 4.8912 4.2560 6.4404 6.9202 6.9309 5.8030 6.6551 4.2886 6.2319 7.8535 8.2069 10.0982 1.7263 6.0968 5.0276 12.5642 1.9687 4.1743 1.2580 1.3739 8.4902 1.6298 1.4320 1.4908 1.3879 6.2108 1.3641 1.3204 5.8954 2.2102 1.5583 1.6995 5.7220 1.4915 1.0787 1.0521 1.1166 8.4959 4.3349 3.6480 1.2714 1.4666 1.2672 4.4707 10.0702 8.0803 10.5071 6.5353 1.3792 2.5176 1.6888 2.3184 9.0281 6.8808 6.0222 6.0528 1.0622 1.1020 1.0865 1.0870 1.0920 1.0965 1.0904 1.1017 1.0925 1.0959
irintensity: 0.2026 0.8082 0.0564 0.1929 0.1201 0.3187 4.5225 1.4143 2.4764 0.8526 1.8944 5.1764 4.8495 1.7279 0.8667 1.2032 1.1236 4.5689 0.8270 0.6710 0.0433 8.2489 4.3265 6.7474 8.2372 3.1282 14.1230 3.4484 30.0618 0.4660 5.2026 15.9589 11.1824 59.2317 10.2578 1.5691 18.5573 34.8963 7.9305 0.8783 24.4960 30.5125 2.6199 5.3733 22.3306 0.3020 0.5867 1.8037 0.5888 46.8059 4.5484 10.2119 6.4617 5.0389 16.5237 3.0820 0.0419 8.5168 568.8969 62.1891 38.1760 24.0030 19.9498 0.3552 41.3913 91.8137 2.5243 71.8643 46.9106 19.1533 29.1325 12.6883 10.6001 23.7028 131.6696 0.6439 0.9682 7.0410 2.4578 4.5142 0.2061 15.9584 34.2870 0.8967 24.0495 15.2671 3.7695
temp: 298.150 k
press: 1.00000 atm
elementType: 16 16 8 8 8 8 7 7 6 6 6 6 6 6 6 6 6 6 6 6 6 1 1 1 1 1 1 1 1 1 1
symmnumber: 1
zpe: 552050.6 jmol-1
zpe.correction: 0.210265 hartree
zpe.thermalcorrener: 0.229703 hartree
zpe.thermalcorrenthalpy: 0.230648 hartree
zpe.thermalcorrgfe: 0.158453 hartree
zpe.sumelectzpe: -1706.229887 hartree
zpe.sumelectthermal: -1706.210448 hartree
zpe.sumelectthermalent: -1706.209504 hartree
zpe.sumelectthermalfe: -1706.281698 hartree
dipole: 4.3249 -2.7967 0.3306
dipole: 5.1610
quadrupole: -154.1964 -136.3797 -132.4159
quadrupole: 3.8154 0.6294 3.7033
quadrupole: -13.1991 4.6176 8.5815 3.8154 0.6294 3.7033
hfenergy: -1706.4401519 hartree
pointgroup: C01 [X(C13H10N2O4S2)]
dipole: -1.7840726 -0.7916563 0.5596443 debye
polarizability: 379.1783479|22.3156343|147.0994478|37.1821717|-12.0653985|187.1421616 unknown
InChI: InChI=1S/C13H10N2O4S2/c16-14(17)11-6-7-13(12(8-11)15(18)19)21-20-9-10-4-2-1-3-5-10/h1-8H,9H2
charge 0 multiplicity 1
31 atoms
S  -0.775447 -1.160843 0.693137
S  -1.169619 -1.508902 -1.529548
O  1.555993 1.456345 -2.117185
O  -0.203455 1.62406 -0.677804
O  5.863256 -0.643832 2.0487
O  5.762148 0.911203 0.377414
N  0.94834 1.158526 -1.02256
N  5.223241 0.034498 1.155855
C  0.991826 -0.693794 0.736992
C  -3.682713 -0.148898 -1.097976
C  1.660654 0.27975 -0.057015
C  -2.441672 -0.116929 -1.947315
C  3.767777 -0.211272 1.020209
C  3.045083 0.506252 0.050271
C  1.769016 -1.402262 1.694447
C  3.142846 -1.158286 1.860359
C  -3.79417 0.724365 0.015855
C  -4.75008 -1.039771 -1.38615
C  -4.951725 0.705778 0.826115
C  -5.906514 -1.05729 -0.577688
C  -6.010197 -0.183908 0.531556
H  -2.644151 -0.355534 -3.008407
H  -1.89855 0.835509 -1.874539
H  3.54565 1.23688 -0.590698
H  1.279321 -2.177265 2.292134
H  3.737843 -1.702604 2.597902
H  -2.971935 1.412505 0.242898
H  -4.670104 -1.721698 -2.241683
H  -5.028411 1.385082 1.682309
H  -6.726077 -1.746071 -0.810942
H  -6.909073 -0.196395 1.158059
