program: Gaussian 09
title: 000262775
version: EM64L-G09RevD.01
frameworkgroup: C1[X(C23H24OS)]
method: RPBEPBE
basis: SDD
operation: Freq
keyword: #p
keyword: freq=noraman
keyword: PBEPBE/SDD
title: #p freq=noraman PBEPBE/SDD
converged: YES YES NO NO
title: Mulliken charges:
elementType: S O C C C C C C C C C C C C C C C C C C C C C C C H H H H H H H H H H H H H H H H H H H H H H H H
charge: 0.185721 -0.267825 -0.570849 0.401232 0.423269 0.445649 -0.648494 -0.348216 -0.394881 -0.376910 -0.369445 -0.363474 -0.303318 -0.229962 -0.259428 -0.248338 -0.250408 -0.249604 -0.247569 -0.278600 -0.240502 -0.248036 -0.247868 -0.202864 -0.676836 0.281614 0.252715 0.267751 0.269298 0.256614 0.257042 0.270470 0.240314 0.194123 0.200302 0.227649 0.227911 0.224958 0.224616 0.226378 0.227582 0.227522 0.228464 0.228125 0.188927 0.184070 0.228230 0.233041 0.199840
chargesum: 0.00000
title: Mulliken charges with hydrogens summed into heavy atoms:
elementType: S O C C C C C C C C C C C C C C C C C C C C C C C
charge: 0.185721 -0.267825 -0.570849 0.401232 0.423269 0.445649 -0.114165 -0.080465 -0.125583 -0.120296 -0.112403 -0.093004 -0.063005 0.164463 -0.031779 -0.020427 -0.025449 -0.024988 -0.021192 -0.051019 -0.012980 -0.019571 -0.019743 0.170134 -0.015725
polarizability: 2.65160973e+02 -7.90457456e+00 2.73779093e+02 -4.92609526e+00 6.63849526e+00 2.65846967e+02
1716.lowfreq: -9.9222 -7.4567 -2.2740 0.0015 0.0016 0.0021 4.7974 22.5675 28.6352
frequency: -8.0127 22.3489 28.5974 39.4218 54.9916 57.1990 65.9073 77.4217 83.4521 97.6375 102.3958 126.5298 160.3537 184.6089 205.7287 236.4307 236.8740 257.1110 259.4555 269.3859 287.0216 300.1292 313.8758 344.8909 403.0255 405.2197 411.8448 413.5513 471.0472 490.3092 503.3506 516.3241 613.2870 614.4886 615.7690 619.8184 622.9142 643.8102 660.0515 705.1657 706.3946 709.2168 729.9699 763.5641 768.7890 785.7131 814.3811 817.0132 853.8958 858.2041 863.8403 882.1329 885.6334 908.6405 930.2147 938.8792 943.1922 964.4312 981.0249 984.6589 988.2305 989.6017 990.3453 990.8515 995.6949 997.9010 999.3605 1003.6926 1028.3772 1031.9742 1032.7302 1049.7005 1084.0360 1084.3885 1089.3295 1090.8656 1116.9640 1136.7002 1143.0357 1171.4122 1173.0171 1173.3036 1176.4803 1192.2981 1197.7391 1198.8133 1201.5577 1206.9746 1216.5456 1252.3658 1276.8948 1312.8060 1321.9993 1327.1837 1336.5888 1370.3386 1374.2544 1376.8638 1388.3527 1402.3925 1428.8788 1432.2372 1435.2327 1437.3080 1458.7214 1464.7357 1476.5023 1479.3206 1480.1519 1481.3074 1493.3118 1581.9761 1585.9094 1587.1795 1605.2385 1606.7665 1609.8425 2904.2153 2917.5686 2961.1560 2963.3155 2994.6496 3024.7251 3092.4157 3102.3636 3105.4555 3120.5226 3121.9205 3122.8043 3128.2997 3131.4316 3132.0539 3140.3902 3144.2935 3150.4301 3151.4704 3155.8292 3161.5587 3163.5783 3166.7587 3170.0339
redmass: 4.5027 4.3922 3.6196 3.9368 4.4104 2.0869 4.7394 3.5122 3.2955 4.1456 4.7926 4.4568 7.2144 4.7980 3.0018 2.6048 1.4297 3.8019 4.2240 5.4982 3.4964 5.0323 4.6470 6.2136 2.8470 2.8640 2.9284 2.9211 3.2216 3.8908 3.6970 3.5935 6.0141 6.2043 5.9882 6.0369 6.0388 4.7136 5.4438 1.8774 1.7585 1.8731 2.3975 1.8479 1.9131 2.1625 3.0395 1.0915 1.2488 1.2448 1.2517 3.7687 3.5221 2.1650 1.4953 1.5307 1.5882 2.2429 1.3952 1.4049 1.5013 5.2230 5.9795 4.5036 1.3152 1.3093 1.3177 1.5864 2.4979 2.1730 2.1989 2.5126 1.7432 3.5609 1.6357 1.6580 2.0348 1.4036 3.1387 1.0559 1.0609 1.0518 1.2145 1.1932 2.4133 1.1408 1.2785 3.6015 1.2944 1.1478 1.2027 1.4123 1.3557 1.3434 1.2319 5.4650 7.1337 8.0092 1.2504 1.4148 2.2251 2.1856 1.5709 1.4347 1.0407 1.0845 2.1614 2.1161 1.0530 2.1201 1.0779 5.7999 5.9881 6.1093 5.9971 5.9588 6.0242 1.0567 1.0557 1.1023 1.1060 1.0358 1.0574 1.0991 1.1010 1.1073 1.0848 1.0847 1.0846 1.0876 1.0884 1.0890 1.0928 1.0933 1.0946 1.0939 1.0958 1.0947 1.1005 1.0996 1.0981
irintensity: 0.3158 0.1170 0.0001 0.5104 0.3972 2.3418 0.0784 1.0917 0.3466 0.1673 2.7054 4.7910 0.8946 1.8720 2.0238 1.1763 0.5004 1.2518 0.9547 0.0294 0.6391 1.0736 0.5295 0.0880 0.1222 0.0171 1.2928 4.7751 9.1753 0.2871 4.2793 1.2510 4.4200 2.2432 4.6412 9.9259 5.5185 6.3438 26.7684 62.8135 46.2790 24.5061 93.2742 28.6436 34.2295 4.0991 1.8912 4.3765 0.1705 0.1285 0.7309 3.6938 2.1078 4.5507 0.2248 0.1090 0.6273 28.8669 0.2954 0.1136 0.2959 0.5976 0.8665 0.3076 0.0696 0.0348 0.8351 12.5377 2.6223 12.8202 13.7308 47.9401 12.6373 109.8843 1.9528 13.8476 33.9235 6.1155 0.7354 0.0787 0.0412 0.0627 1.6532 5.3048 3.4647 2.6593 4.6316 8.0654 5.4721 0.4485 17.2166 2.6341 0.5994 1.2033 49.8241 0.8875 0.6716 1.1724 14.7729 13.0172 15.3815 11.5133 13.2149 6.4618 10.9023 13.4729 16.4427 24.9891 3.9402 31.2910 5.6214 0.6636 0.0762 0.5023 6.7863 9.5407 3.7968 28.0262 129.9941 90.2858 9.3810 26.8066 22.9188 39.2373 34.4360 9.3106 0.7540 1.1873 0.5268 2.4784 3.9919 13.6539 13.9971 24.8370 65.3224 4.6435 21.1363 15.8934 33.6110 22.5264 10.1046
temp: 298.150 k
press: 1.00000 atm
elementType: 16 8 6 6 6 6 6 6 6 6 6 6 6 6 6 6 6 6 6 6 6 6 6 6 6 1 1 1 1 1 1 1 1 1 1 1 1 1 1 1 1 1 1 1 1 1 1 1 1
symmnumber: 1
zpe: 1052566.4 jmol-1
zpe.correction: 0.400901 hartree
zpe.thermalcorrener: 0.423881 hartree
zpe.thermalcorrenthalpy: 0.424825 hartree
zpe.thermalcorrgfe: 0.346806 hartree
zpe.sumelectzpe: -1362.309000 hartree
zpe.sumelectthermal: -1362.286020 hartree
zpe.sumelectthermalent: -1362.285076 hartree
zpe.sumelectthermalfe: -1362.363096 hartree
dipole: -0.3632 2.1425 0.6329
dipole: 2.2634
quadrupole: -141.3205 -144.7759 -146.0039
quadrupole: -7.1281 0.0028 2.3539
quadrupole: 2.7130 -0.7425 -1.9705 -7.1281 0.0028 2.3539
hfenergy: -1362.7099016 hartree
pointgroup: C01 [X(C23H24O1S1)]
dipole: 0.0421511 0.8893627 -0.0140639 debye
polarizability: 264.4471344|8.1653374|278.4975249|-1.8568564|-1.8373441|261.8423739 unknown
InChI: InChI=1S/C23H24OS/c1-2-24-18-19-25-23(20-12-6-3-7-13-20,21-14-8-4-9-15-21)22-16-10-5-11-17-22/h3-17H,2,18-19H2,1H3
charge 0 multiplicity 1
49 atoms
S  1.330087 -0.409299 0.72007
O  4.335122 0.195471 1.210915
C  -0.418695 -0.179064 -0.188604
C  -1.38046 -1.006006 0.700157
C  -0.821503 1.309662 -0.173834
C  -0.277851 -0.76094 -1.611856
C  2.437774 0.872127 -0.127813
C  -0.989443 -2.268344 1.226042
C  -1.55808 1.885062 -1.242362
C  -0.857249 -2.002501 -1.980796
C  -2.698142 -0.551692 0.964831
C  -0.574585 2.110305 0.973797
C  0.458892 -0.055589 -2.605728
C  3.502285 1.346738 0.857173
C  -1.878004 -3.038398 2.006395
C  -2.010674 3.22352 -1.177477
C  -0.691701 -2.528962 -3.282516
C  -3.592132 -1.326376 1.738771
C  -1.026059 3.445171 1.042008
C  0.628894 -0.579661 -3.90263
C  -3.187219 -2.572107 2.266888
C  -1.744097 4.012872 -0.037228
C  0.056325 -1.825581 -4.250833
C  5.329606 0.513099 2.246152
C  6.117994 -0.764566 2.530926
H  2.902272 0.413663 -1.01502
H  1.807228 1.728673 -0.421944
H  0.018984 -2.646799 1.026096
H  -1.786411 1.28463 -2.128552
H  -1.449634 -2.563426 -1.253044
H  -3.030543 0.413366 0.571122
H  -0.02358 1.668655 1.812031
H  0.891623 0.921137 -2.369285
H  4.126109 2.137759 0.378874
H  3.026621 1.778095 1.766133
H  -1.547163 -4.003086 2.407454
H  -2.575899 3.643601 -2.017274
H  -1.152911 -3.490177 -3.536775
H  -4.603944 -0.951098 1.930091
H  -0.821139 4.041357 1.93866
H  1.204908 -0.013123 -4.643304
H  -3.878693 -3.169113 2.872122
H  -2.092855 5.050524 0.012816
H  0.18648 -2.234791 -5.25889
H  4.812723 0.875995 3.1629
H  6.001148 1.326081 1.887202
H  6.625448 -1.116587 1.616364
H  5.439964 -1.562954 2.87797
H  6.880478 -0.584124 3.310601
