program: Gaussian 09
title: 000262743
version: EM64L-G09RevD.01
frameworkgroup: C1[X(C10H18O5S2)]
method: RPBEPBE
basis: SDD
operation: Freq
keyword: #p
keyword: freq=noraman
keyword: PBEPBE/SDD
title: #p freq=noraman PBEPBE/SDD
converged: YES YES NO NO
title: Mulliken charges:
elementType: S S O O O O O C C C C C C C C C C H H H H H H H H H H H H H H H H H H
charge: 0.049308 0.042089 -0.262771 -0.234099 -0.235696 -0.255127 -0.285567 -0.425823 -0.695352 -0.647189 -0.288615 0.269403 -0.263484 -0.662907 -0.272415 0.336338 -0.661533 0.260695 0.264337 0.276755 0.287542 0.307916 0.273292 0.250712 0.250214 0.234616 0.225053 0.218539 0.247234 0.229621 0.230830 0.235514 0.219643 0.232772 0.248153
chargesum: 0.00000
title: Mulliken charges with hydrogens summed into heavy atoms:
elementType: S S O O O O O C C C C C C C C C C
charge: 0.049308 0.042089 -0.262771 -0.234099 -0.235696 -0.255127 -0.285567 0.099209 -0.131054 -0.065981 0.212312 0.269403 0.196184 0.032486 0.193929 0.336338 0.039035
polarizability: 2.27768223e+02 3.81278327e+00 1.42021105e+02 2.99456767e+00 8.01292439e-01 1.32545841e+02
1716.lowfreq: -8.6397 -0.0021 -0.0011 0.0016 4.6823 5.6847 10.4649 11.7968 18.3249
frequency: -2.9727 11.0988 17.6594 26.3309 42.2901 47.9711 63.2307 73.6051 86.1695 93.4466 101.8564 122.4325 147.8640 160.7357 176.6620 206.2529 219.3545 227.0740 277.6547 280.0757 300.8091 332.4879 362.8274 372.0188 413.3551 445.8996 450.7920 507.2070 570.2456 607.1124 626.6946 636.9225 690.0316 699.7771 764.2707 787.7885 794.5962 804.7321 816.8993 825.3571 897.0915 902.2497 955.4543 977.0950 1000.1482 1010.3501 1032.5139 1065.5018 1068.8653 1094.9518 1096.0554 1119.4364 1155.2769 1158.4313 1163.3191 1174.1625 1192.9840 1231.5210 1246.0090 1271.5931 1277.5899 1280.4256 1296.5947 1331.7273 1356.4810 1357.5213 1369.6553 1390.6286 1392.3936 1432.0497 1438.2136 1440.6623 1443.0053 1456.1979 1458.8036 1463.2606 1464.8247 1484.0791 1485.6380 1622.6788 1632.6286 2982.0811 2993.5408 2994.5537 3020.0258 3024.2581 3030.4065 3032.8820 3041.5684 3078.3962 3088.9249 3089.9801 3093.5858 3097.6056 3108.0201 3109.7345 3120.0083 3124.5502 3128.6663
redmass: 4.4551 5.4803 4.8505 5.3025 3.7968 4.1896 4.4836 4.9922 3.9034 3.9904 3.8610 3.5445 3.1970 3.6095 3.5045 3.1600 1.4030 1.6857 2.3919 3.7946 2.6340 3.3259 3.7080 3.7456 6.1687 4.1555 4.0294 3.3879 3.1225 3.9171 5.9367 5.7768 3.2641 11.7594 1.3961 1.7096 1.7969 2.6208 1.9562 2.1096 3.7020 2.1368 2.3584 1.6894 1.8918 2.8161 2.2643 5.2092 4.0113 2.1961 2.1668 1.8584 1.6849 1.6830 1.5718 1.5403 3.8329 1.2137 1.2581 1.1358 1.1197 1.1168 1.1653 1.4645 1.2414 1.3760 1.2818 1.2326 1.2340 1.0886 1.1061 1.0846 1.0927 1.0940 1.0901 1.0433 1.0485 1.0507 1.0530 8.1826 8.8622 1.0669 1.0360 1.0361 1.0607 1.0600 1.0596 1.0607 1.0593 1.0939 1.0974 1.0974 1.1030 1.1022 1.1033 1.1046 1.1063 1.1064 1.1056
irintensity: 1.0727 0.0769 0.3917 0.2510 0.3270 0.2485 0.6481 3.2819 0.1755 0.8170 3.2666 3.3333 1.0368 2.5118 4.9980 1.1422 4.5329 5.9611 3.2094 1.9582 22.1471 29.7576 4.9823 6.4321 3.3369 5.4760 0.7943 1.7835 4.6268 0.4198 10.5300 1.4423 6.4624 23.7043 25.6796 13.9371 4.8879 15.4346 7.1829 11.6274 10.0554 30.0694 47.6695 2.6300 79.5549 52.8226 24.2957 6.1272 36.8563 64.8349 29.3001 206.9530 27.1009 104.0508 125.3615 169.9779 738.5211 9.6837 33.1919 0.2914 4.6012 9.1435 24.9392 79.5683 9.2418 15.5005 4.5488 21.7955 25.1311 2.9291 25.7084 14.0817 44.0835 11.9236 18.6969 14.2810 14.7055 13.0184 15.6911 185.0111 148.6088 17.3975 17.5420 17.8589 16.4923 9.6939 32.7034 26.0305 12.1833 0.9769 37.4005 31.2189 0.9185 2.0482 5.2823 2.4706 33.1525 31.2517 10.7666
temp: 298.150 k
press: 1.00000 atm
elementType: 16 16 8 8 8 8 8 6 6 6 6 6 6 6 6 6 6 1 1 1 1 1 1 1 1 1 1 1 1 1 1 1 1 1 1
symmnumber: 1
zpe: 723970.7 jmol-1
zpe.correction: 0.275746 hartree
zpe.thermalcorrener: 0.296439 hartree
zpe.thermalcorrenthalpy: 0.297384 hartree
zpe.thermalcorrgfe: 0.220937 hartree
zpe.sumelectzpe: -1562.736517 hartree
zpe.sumelectthermal: -1562.715823 hartree
zpe.sumelectthermalent: -1562.714879 hartree
zpe.sumelectthermalfe: -1562.791326 hartree
dipole: 0.5083 -1.3417 0.4658
dipole: 1.5085
quadrupole: -81.7192 -116.4079 -122.7793
quadrupole: -2.7697 -0.5889 -0.4238
quadrupole: 25.2496 -9.4391 -15.8105 -2.7697 -0.5889 -0.4238
hfenergy: -1563.0122627 hartree
pointgroup: C01 [X(C10H18O5S2)]
dipole: 0.2184412 0.3211754 0.4487072 debye
polarizability: 226.2743619|6.4165798|133.1539906|-10.6859768|0.9736135|142.906817 unknown
InChI: InChI=1S/C10H18O5S2/c1-3-13-9(11)5-7-16-17-8-6-15-10(12)14-4-2/h3-8H2,1-2H3
charge 0 multiplicity 1
35 atoms
S  0.928696 -1.249003 -2.81381
S  -0.24594 -1.289298 -0.872242
O  5.444485 -0.754666 -0.200274
O  -2.682233 -0.240768 0.874639
O  -4.645067 -1.28782 0.980558
O  4.352247 1.25362 -0.678829
O  -4.413423 0.495668 -0.536166
C  3.285713 -0.910997 -1.230843
C  2.419679 -0.204663 -2.28218
C  -1.220374 0.338318 -1.073868
C  -1.784465 0.785193 0.274833
C  4.381318 -0.000259 -0.696841
C  6.56737 0.004954 0.438219
C  6.26421 0.278578 1.913689
C  -6.077146 -1.455411 0.569168
C  -3.966298 -0.271413 0.349584
C  -6.98097 -0.484624 1.331428
H  3.732391 -1.839808 -1.622904
H  2.646437 -1.201659 -0.371394
H  2.970329 -0.035467 -3.225512
H  2.061572 0.769815 -1.914965
H  -2.01503 0.184134 -1.818624
H  -0.5145 1.102842 -1.440456
H  -2.34736 1.727531 0.142569
H  -0.993486 0.908838 1.030833
H  6.718742 0.943629 -0.123231
H  7.434414 -0.66216 0.309392
H  7.137461 0.76183 2.389981
H  5.398939 0.954552 2.018033
H  6.053044 -0.660608 2.453423
H  -6.285728 -2.505996 0.824164
H  -6.149387 -1.30502 -0.522342
H  -8.038863 -0.69565 1.088109
H  -6.848883 -0.598299 2.421065
H  -6.765495 0.559389 1.048292
