program: Gaussian 09
title: 000262729
version: EM64L-G09RevD.01
frameworkgroup: C1[X(C7H15NO2S)]
method: RPBEPBE
basis: SDD
operation: Freq
keyword: #p
keyword: freq=noraman
keyword: PBEPBE/SDD
title: #p freq=noraman PBEPBE/SDD
converged: YES YES NO NO
title: Mulliken charges:
elementType: S O O N C C C C C C C H H H H H H H H H H H H H H H
charge: -0.006291 -0.309666 -0.242750 -0.621239 0.327226 -0.704827 -0.700786 -0.703989 -0.150791 0.337533 -0.738517 0.269331 0.222080 0.210383 0.223369 0.229720 0.206558 0.268035 0.211687 0.218624 0.234157 0.309123 0.256784 0.275882 0.292802 0.085560
chargesum: 0.00000
title: Mulliken charges with hydrogens summed into heavy atoms:
elementType: S O O N C C C C C C C
charge: 0.079268 -0.309666 -0.242750 -0.052554 0.327226 -0.003032 -0.041140 -0.005643 0.083367 0.337533 -0.172610
polarizability: 1.18965220e+02 2.80668968e+00 1.04123512e+02 2.22632967e+00 -4.92718172e-02 9.05677271e+01
1716.lowfreq: -14.3731 -4.8229 0.0014 0.0023 0.0026 8.0702 28.2106 46.5477 83.9767
frequency: 26.1514 46.2459 83.9589 107.7749 138.4186 160.2044 176.4357 214.9729 224.7824 227.3361 238.7521 245.6639 290.9490 310.1802 335.9582 354.0262 380.4165 408.2386 447.8884 475.0553 585.8548 611.4480 675.9678 720.0159 757.5055 774.9279 808.3692 853.4973 915.8471 922.6456 954.4623 970.1559 1021.6689 1030.3485 1032.4151 1087.8268 1115.7372 1167.5218 1192.2754 1211.8489 1257.6787 1262.8257 1271.3206 1311.0610 1374.7384 1375.8529 1378.8948 1401.0156 1425.8719 1444.2734 1465.6564 1466.7187 1470.2309 1479.1858 1500.9325 1629.0085 1648.8985 2424.9253 2899.5589 2989.7470 2991.0376 2995.9449 3041.6469 3081.2174 3084.7274 3095.0539 3097.6542 3115.0529 3118.9216 3130.4475 3460.7110 3593.0480
redmass: 4.2323 4.3333 5.7088 3.1048 3.2652 1.1199 3.2604 1.7515 1.1283 1.3077 1.2341 1.1112 2.4523 3.5303 2.8279 2.8192 4.8034 2.7391 3.1828 2.5894 1.6371 2.4646 4.2625 5.6185 4.7224 1.5979 2.6856 3.0863 1.5864 1.6346 1.2035 1.7283 2.6629 1.4241 1.4216 2.4977 3.7497 1.1185 2.2605 1.4658 3.0741 1.1714 3.0589 1.2967 1.5936 1.2558 1.3226 1.2136 1.0904 1.0467 1.0530 1.0555 1.0638 1.0531 1.0549 1.0934 10.1190 1.0383 1.0818 1.0361 1.0357 1.0368 1.0609 1.0993 1.0992 1.0992 1.1000 1.1000 1.0993 1.1042 1.0445 1.0984
irintensity: 0.2949 2.0936 3.3429 0.4091 4.3359 0.0957 0.9763 0.5897 13.4665 11.0321 0.0344 54.8233 10.0434 18.6052 2.5296 14.9869 4.5135 2.4117 1.1763 0.5685 134.6342 101.1317 2.7477 19.6301 15.3092 1.4926 8.8278 13.7493 0.8472 1.5002 0.2173 7.6004 8.3747 0.0631 1.2570 105.5539 474.0554 9.4361 6.2769 0.6156 26.5372 6.4310 17.2688 8.1538 21.6414 35.5725 27.2538 20.6004 25.5288 0.9060 7.3880 3.1809 12.8210 4.4929 26.1622 53.2414 147.3713 33.3907 55.2279 16.8608 18.2203 25.6744 26.4323 9.2778 12.8276 53.6756 36.6525 4.1240 16.1330 2.3332 1.8748 2.1979
temp: 298.150 k
press: 1.00000 atm
elementType: 16 8 8 7 6 6 6 6 6 6 6 1 1 1 1 1 1 1 1 1 1 1 1 1 1 1
symmnumber: 1
zpe: 559778.2 jmol-1
zpe.correction: 0.213208 hartree
zpe.thermalcorrener: 0.227811 hartree
zpe.thermalcorrenthalpy: 0.228755 hartree
zpe.thermalcorrgfe: 0.171585 hartree
zpe.sumelectzpe: -878.091216 hartree
zpe.sumelectthermal: -878.076613 hartree
zpe.sumelectthermalent: -878.075669 hartree
zpe.sumelectthermalfe: -878.132839 hartree
dipole: 1.9235 2.4452 -2.7813
dipole: 4.1731
quadrupole: -67.7733 -73.8135 -77.0682
quadrupole: -7.6130 5.2956 -0.8149
quadrupole: 5.1117 -0.9285 -4.1832 -7.6130 5.2956 -0.8149
hfenergy: -878.3044241 hartree
pointgroup: C01 [X(C7H15N1O2S1)]
dipole: -0.6155041 0.3947486 1.4700189 debye
dipolederiv: -0.2466837 0.0400649 0.1338905 0.0427544 -0.2179677 -0.0512792 0.1545165 0.0413913 0.1380863 -1.7180047 0.0394694 0.2520398 -0.0233078 -0.3495041 -0.0271005 0.3560284 -0.0289699 -0.5955461 -0.7328716 0.0191987 -0.0804371 0.028013 -0.3009476 -0.0408123 0.286632 -0.0633223 -0.8447399 -0.4214365 0.0871138 0.0344143 0.0433977 -0.7778296 0.0715688 0.0540266 0.0323159 -0.5341872 1.0706246 -0.0078573 -0.060124 0.0277015 0.4496117 -0.0188267 0.1279525 -0.0206015 0.3297689 -0.1189567 0.0037648 0.0351768 -0.0257111 -0.1398049 -0.0940139 -0.0169817 -0.0680453 -0.0648752 -0.0661884 0.0085003 0.0619803 0.0071924 0.0241086 -0.0063504 0.0670265 -0.0039807 -0.0942806 -0.1194168 0.0108181 0.0262651 0.0264632 -0.1062897 0.1079473 -0.0235493 0.079335 -0.0968791 0.0794247 -0.126369 -0.0704989 -0.0132485 0.4796206 -0.0692957 -0.0444878 0.1315735 0.2422197 1.6491233 -0.0522908 -0.1198561 0.0367631 0.1800645 0.1053661 -0.6515981 0.1089894 1.0821562 0.0863535 -0.0460138 0.0132994 -0.1544112 0.3725433 0.0996371 -0.051231 -0.056167 -0.0020844 0.0936874 0.0398624 0.1013292 0.023309 0.0922507 0.0008653 0.0888637 -0.0302258 -0.0175288 0.1070055 0.0476969 -0.0405157 0.0308121 -0.0627655 0.0761139 -0.0325769 0.122892 -0.0098529 -0.1647101 -0.0368168 -0.0719642 -0.0273761 0.0851979 -0.0019168 -0.0682873 -0.0105493 0.101691 0.1056052 -0.0498277 -0.0216815 -0.0229045 -0.0992114 -0.1180229 0.0090151 -0.0825195 0.0289203 0.1018063 0.0494092 -0.0391838 0.0334936 -0.0440648 0.1287971 -0.0030541 0.0965614 -0.0124839 -0.1626239 -0.0099575 -0.027651 -0.0178261 0.1022557 -0.0056036 -0.0765351 -0.0074038 0.0635533 0.0969414 -0.0222689 0.1078835 -0.0047317 0.0944234 -0.020687 0.0885438 0.0098439 -0.0257545 -0.1693068 0.0158657 -0.0716232 0.0021637 0.0886896 0.0017954 -0.0675314 0.0102073 0.1019838 0.1103425 -0.0526235 -0.0306027 -0.0332767 -0.1047539 -0.0579955 -0.0241832 -0.1090273 0.0257833 0.0077287 -0.0033492 0.0132129 -0.0261827 -0.1813473 0.0765608 -0.0007876 0.1105786 -0.0692751 0.1586318 0.0241683 -0.0185984 0.022726 0.0240261 0.0431268 0.0578698 0.0218653 0.0031016 -0.0883258 -0.0313955 -0.0531041 -0.0335178 -0.0627168 -0.0590969 -0.0902927 -0.0914364 0.0325909 0.0889181 -0.0034 -0.1110565 0.0379326 0.2289269 -0.0569974 -0.189173 -0.0993906 0.1873601 0.134727 0.0284681 0.0956397 0.014557 0.2161396 -0.0421824 0.1651405 -0.1530278 0.1966526 0.117605 0.0277696 -0.0582344 0.0052152 0.0093445 -0.0415973 -0.1153462 0.0591136 -0.1663805 unknown
polarizability: 117.0803204|-6.4206032|102.4306442|0.3424339|6.1935539|94.1454946 unknown
InChI: InChI=1S/C7H15NO2S/c1-7(2,3)10-6(9)5(8)4-11/h5,11H,4,8H2,1-3H3
charge 0 multiplicity 1
26 atoms
S  3.202782 -1.969018 -0.579587
O  -0.634137 0.067321 0.608964
O  0.433084 -0.106611 -1.476951
N  1.77737 1.588335 1.072008
C  -2.061962 -0.023678 0.05706
C  -2.242513 -1.387472 -0.637783
C  -2.907085 0.078085 1.33761
C  -2.315819 1.166091 -0.889283
C  1.743755 0.177966 0.621482
C  0.471241 0.015145 -0.234601
C  2.996714 -0.121792 -0.218063
H  -1.60715 -1.464537 -1.533724
H  -1.989735 -2.211011 0.05314
H  -3.298793 -1.504568 -0.942051
H  -2.72755 1.039084 1.850444
H  -2.657831 -0.741219 2.033706
H  -3.980329 0.011139 1.084619
H  -1.700691 1.090269 -1.79926
H  -3.381591 1.177239 -1.182724
H  -2.089688 2.121143 -0.382496
H  1.672997 -0.554406 1.460152
H  2.916747 0.357768 -1.204851
H  3.906311 0.238478 0.29068
H  2.614379 1.835251 1.608483
H  0.909671 1.891857 1.524424
H  3.641725 -2.317658 0.690001
