program: Gaussian 09
title: 000262770
version: EM64L-G09RevD.01
frameworkgroup: C1[X(C22H29N3O6)]
method: RPBEPBE
basis: SDD
operation: Freq
keyword: #p
keyword: freq=noraman
keyword: PBEPBE/SDD
title: #p freq=noraman PBEPBE/SDD
converged: YES YES NO NO
title: Mulliken charges:
elementType: O O O O O O N N N C C C C C C C C C C C C C C C C C C C C C C H H H H H H H H H H H H H H H H H H H H H H H H H H H H H
charge: -0.336652 -0.284401 -0.272448 -0.200500 -0.202958 -0.241788 -0.381179 -0.207605 -0.374136 -0.409574 -0.000539 -0.212311 -0.741900 -0.705985 0.212394 0.267740 -0.537586 0.334102 -0.430436 0.183341 0.187228 0.106267 0.123837 0.270274 -0.703789 -0.703465 -0.703647 -0.354305 -0.354676 -0.211768 -0.211870 0.219380 0.202457 0.261169 0.183549 0.335663 0.215067 0.191890 0.263072 0.201088 0.204736 0.266241 0.280704 0.267237 0.359599 0.270622 0.274791 0.222057 0.217803 0.267913 0.230636 0.226756 0.214592 0.224881 0.217652 0.266793 0.268561 0.268364 0.237579 0.237481
chargesum: 0.00000
title: Mulliken charges with hydrogens summed into heavy atoms:
elementType: O O O O O O N N N C C C C C C C C C C C C C C C C C C C C C C
charge: -0.336652 -0.284401 -0.272448 -0.200500 -0.202958 -0.241788 -0.045516 -0.207605 -0.014537 0.012264 0.183011 0.048859 -0.071872 -0.033919 0.212394 0.267740 0.010355 0.334102 0.114978 0.183341 0.187228 0.106267 0.123837 0.270274 0.003984 -0.031481 0.005679 -0.085745 -0.086312 0.025811 0.025610
polarizability: 3.31403975e+02 9.15760435e+00 2.61875695e+02 -3.96649578e+01 4.16470133e+00 2.44572185e+02
1716.lowfreq: -5.7774 -4.6706 -0.0005 0.0004 0.0010 3.8166 6.0762 8.8922 15.4852
frequency: 5.0939 8.7156 15.4790 19.1809 20.4548 29.7087 42.1649 50.2876 65.7151 76.3059 88.2091 92.5472 99.0245 118.8072 125.4723 139.5976 141.1166 160.6006 177.7943 180.3362 190.1818 201.5726 211.3908 225.3798 235.2972 241.5352 243.1406 249.0423 261.8094 266.5667 297.0240 300.0028 322.6793 331.7311 333.8643 347.4601 357.8509 364.9649 386.5511 415.3502 415.5492 429.4425 430.5668 455.8058 500.1362 523.2012 534.7359 539.3883 551.6028 561.9309 586.8813 605.8938 624.2467 648.2282 658.3280 675.0192 682.4553 686.1180 703.9657 720.6803 742.2937 764.0588 787.4730 797.9427 800.7615 804.7842 833.9440 845.1961 882.8533 906.7853 909.4909 917.5615 919.2192 926.9863 944.9822 949.6914 955.1773 958.2942 972.7950 974.1837 978.2060 979.1268 1004.7162 1005.7816 1019.6753 1029.9307 1032.2529 1067.8343 1072.4300 1091.1305 1095.2542 1122.3808 1144.8125 1154.7260 1168.9103 1172.5766 1200.7848 1206.6759 1210.2973 1210.7342 1222.4908 1224.7309 1246.1679 1259.9024 1272.2025 1275.7934 1283.4066 1306.6963 1309.6832 1316.1669 1328.8977 1336.1784 1348.0413 1355.1653 1369.4583 1378.6128 1382.3296 1382.7565 1400.9896 1404.1276 1415.6843 1431.3618 1446.9556 1448.4344 1454.3881 1454.5294 1461.1277 1463.7081 1467.1370 1468.3796 1472.2721 1478.8546 1480.7119 1482.0768 1488.4475 1495.7867 1501.3555 1503.7030 1606.1118 1614.7993 1620.0873 1629.7442 1633.1393 1644.8156 1682.7909 2944.3193 2961.5889 2970.5372 2984.3001 2991.0998 2992.4168 2994.9541 2997.4895 3009.0028 3022.6148 3036.0660 3041.6323 3055.1545 3065.9674 3072.5562 3073.8179 3083.8875 3086.0531 3096.5419 3097.8062 3107.7969 3115.0574 3119.5220 3138.7044 3152.5486 3164.4294 3174.2297 3468.2393 3535.0434
redmass: 5.0245 4.7659 6.9787 4.0972 3.8945 4.4442 5.2794 4.2841 5.0354 4.6101 5.0284 4.7294 4.7583 4.0009 3.3432 4.6107 3.9011 4.7857 1.0760 6.1517 4.0512 5.3812 3.7812 3.2322 1.1067 1.1557 1.0766 3.9669 3.4339 1.0840 5.5079 3.2387 5.8900 2.5935 3.6220 6.1478 2.9216 2.3671 2.4400 2.8253 3.2773 3.1707 2.8979 4.8914 4.1921 6.9601 3.1475 3.7440 2.8414 3.9220 4.9386 6.2618 1.3112 1.3811 4.8170 3.5904 6.5070 5.0345 4.5267 4.0224 5.1363 3.7108 5.2024 1.9158 3.4809 3.4244 4.2992 2.0009 5.0770 1.4030 3.3549 1.5856 1.2579 1.9561 3.3862 1.8827 1.2043 2.1167 2.6967 1.4142 2.8816 2.5876 2.4540 1.3471 2.0377 1.4201 1.4233 2.7831 2.5553 2.8168 3.5609 1.8235 2.7871 2.5215 1.1561 2.0240 1.9774 1.9269 1.1104 3.1225 1.5819 2.2794 1.5179 3.0447 1.9224 1.8790 1.4806 1.3918 1.4792 1.3439 1.5231 1.5682 1.4960 1.2986 6.9271 1.2268 1.2261 1.2230 1.2146 1.2145 5.3675 1.1559 1.0464 1.1058 2.5125 2.7094 1.0828 1.0469 1.0504 1.0545 1.1290 1.0567 1.5354 1.2459 1.0811 1.9525 1.0566 1.0543 8.0665 7.6977 7.8390 6.9633 11.8750 9.9684 11.7711 1.0786 1.0385 1.0612 1.0404 1.0357 1.0364 1.0597 1.0371 1.0581 1.0956 1.1003 1.0891 1.0979 1.0990 1.1000 1.1033 1.0994 1.0992 1.0993 1.1002 1.0967 1.1005 1.0996 1.0863 1.0906 1.0956 1.1004 1.0769 1.0780
irintensity: 0.1957 0.5685 0.4497 0.7057 0.7666 1.4139 0.5278 1.4497 3.3784 3.6295 5.9537 7.7909 4.3188 0.6429 2.2252 0.1758 1.4690 1.7003 0.0294 1.8709 6.4132 5.6938 0.1680 3.8646 0.4215 1.6772 0.2233 6.4176 5.6454 0.3034 29.3007 6.2994 22.3638 2.3448 2.8956 11.7348 3.9436 2.6012 0.6577 6.6040 3.6835 14.7990 2.9323 0.0710 6.0072 4.9260 2.1744 7.1205 0.1658 5.6296 2.1235 24.4718 61.4973 110.3708 0.2695 7.5345 2.2970 3.3659 27.7140 70.0485 9.6486 41.6378 0.0584 16.6738 2.5588 17.7884 0.2778 18.0691 42.0253 0.0307 12.7544 0.8588 5.4656 16.0311 67.9465 4.3153 0.1911 10.6136 0.4818 1.9454 18.3876 10.4664 9.7174 0.0151 1.3650 0.2229 1.3605 4.4773 20.3018 27.7013 9.5967 1.1502 218.3591 230.8142 10.1167 5.8379 6.2180 13.6888 1.6132 42.4293 26.5694 67.5968 39.1289 27.9192 55.6682 19.4475 0.0640 19.4336 5.7891 7.8981 24.4269 0.8980 11.3034 2.0646 314.0773 43.4690 42.6798 19.7025 26.2748 30.3180 4.9336 49.6084 0.4900 37.7255 9.9479 5.1901 7.0835 12.9776 11.9633 2.5264 129.7661 12.6402 313.0084 243.7641 11.9369 139.7980 25.5053 6.3070 242.3796 0.8105 60.2922 92.7737 395.6858 190.9518 40.0634 22.7058 35.6800 73.2343 30.7162 10.0783 20.4039 21.9089 16.9114 21.8778 8.0261 4.2215 29.4996 44.8978 34.4175 31.3511 1.8339 7.5419 7.9758 54.2701 36.1828 26.5891 4.1912 13.7081 1.8182 6.0771 6.3307 22.8643 86.2654 101.1370
temp: 298.150 k
press: 1.00000 atm
elementType: 8 8 8 8 8 8 7 7 7 6 6 6 6 6 6 6 6 6 6 6 6 6 6 6 6 6 6 6 6 6 6 1 1 1 1 1 1 1 1 1 1 1 1 1 1 1 1 1 1 1 1 1 1 1 1 1 1 1 1 1
symmnumber: 1
zpe: 1270078.1 jmol-1
zpe.correction: 0.483747 hartree
zpe.thermalcorrener: 0.516553 hartree
zpe.thermalcorrenthalpy: 0.517497 hartree
zpe.thermalcorrgfe: 0.413028 hartree
zpe.sumelectzpe: -1469.088098 hartree
zpe.sumelectthermal: -1469.055292 hartree
zpe.sumelectthermalent: -1469.054348 hartree
zpe.sumelectthermalfe: -1469.158817 hartree
dipole: 1.0684 -0.2264 4.3623
dipole: 4.4969
quadrupole: -143.9769 -185.6826 -186.1810
quadrupole: 7.5130 12.4374 -7.3359
quadrupole: 27.9700 -13.7358 -14.2342 7.5130 12.4374 -7.3359
hfenergy: -1469.5718449 hartree
pointgroup: C01 [X(C22H29N3O6)]
dipole: 0.4933316 1.0683273 1.3211595 debye
polarizability: 327.8212606|-21.8174502|259.3962182|-38.5059848|-6.4756127|250.6343755 unknown
InChI: InChI=1S/C22H29N3O6/c1-13(2)10-16(19(28)23-11-18(27)31-22(3,4)5)24-17(26)12-25-20(29)14-8-6-7-9-15(14)21(25)30/h6-9,13,16,23-24H,10-12H2,1-5H3
charge 0 multiplicity 1
60 atoms
O  5.567878 -0.337994 0.51314
O  2.115175 -1.193368 -2.786563
O  -1.121671 0.419349 0.357533
O  -3.421076 -2.713682 0.668473
O  -4.068409 1.491813 -1.341021
O  6.834206 -1.945975 -0.645252
N  -0.049359 0.005229 -1.671655
N  -3.503198 -0.680489 -0.562602
N  3.482882 -0.498691 -1.043095
C  1.583104 1.947055 -1.920989
C  0.830814 3.192767 -1.365184
C  1.256847 0.558261 -1.284531
C  0.956062 3.315506 0.173449
C  -0.64847 3.287483 -1.811345
C  2.316064 -0.462479 -1.762252
C  -1.111349 -0.087024 -0.804785
C  -2.315556 -0.881167 -1.373642
C  6.621711 -0.04443 1.59594
C  4.59199 -1.373972 -1.429126
C  -5.083613 -0.910619 1.127644
C  -5.280721 0.354502 0.521176
C  -3.931196 -1.58807 0.451555
C  -4.25871 0.527361 -0.560097
C  5.794701 -1.267515 -0.493137
C  7.890716 0.505374 0.917699
C  5.916959 1.025593 2.444837
C  6.879418 -1.334603 2.396734
C  -5.896587 -1.351244 2.182148
C  -6.297921 1.220064 0.948951
C  -6.927678 -0.481688 2.623998
C  -7.125391 0.784331 2.016595
H  1.41879 1.870975 -3.014462
H  2.670395 2.116987 -1.775808
H  1.260516 0.645346 -0.182758
H  1.360819 4.060547 -1.815621
H  -0.042847 -0.511882 -2.55978
H  0.563404 4.290986 0.51484
H  2.011566 3.244758 0.504125
H  0.369919 2.527361 0.680876
H  -0.749229 3.156681 -2.905118
H  -1.060213 4.280799 -1.551631
H  -1.280838 2.533856 -1.315377
H  -2.080813 -1.961653 -1.359474
H  -2.519753 -0.566832 -2.412742
H  3.614824 0.066163 -0.200349
H  4.935334 -1.146051 -2.456756
H  4.268853 -2.432653 -1.452446
H  7.649483 1.383139 0.292517
H  8.606032 0.826304 1.696731
H  8.374161 -0.260878 0.292107
H  4.975054 0.634842 2.867209
H  5.689322 1.920442 1.839975
H  6.572409 1.329017 3.280412
H  5.93449 -1.737444 2.801819
H  7.546402 -1.10595 3.247891
H  7.360725 -2.103086 1.772104
H  -5.733613 -2.330103 2.643749
H  -6.439683 2.195716 0.473736
H  -7.580984 -0.79008 3.447259
H  -7.928449 1.434517 2.379979
