program: Gaussian 09
title: 000262718
version: EM64L-G09RevD.01
frameworkgroup: C1[X(C5H8O2S)]
method: RPBEPBE
basis: SDD
operation: Freq
keyword: #pfreq=noraman
keyword: PBEPBE/SDD
title: #p freq=noraman PBEPBE/SDD
converged: YES YES NO NO
title: Mulliken charges:
elementType: S O O C C C C C H H H H H H H H
charge: 0.206461 -0.191787 -0.188949 -0.762874 0.315518 -0.766721 0.012866 -0.710368 0.283040 0.288578 0.256829 0.229991 0.270213 0.261961 0.241817 0.253423
chargesum: 0.00000
title: Mulliken charges with hydrogens summed into heavy atoms:
elementType: S O O C C C C C
charge: 0.206461 -0.191787 -0.188949 -0.191255 0.315518 -0.009688 0.012866 0.046834
polarizability: 9.07182025e+01 -1.73150513e+00 7.62833638e+01 -7.86364423e+00 -7.79272545e-01 6.07968703e+01
1716.lowfreq: 0.0022 0.0024 0.0029 4.9676 13.4217 19.7122 33.0571 58.3934 67.5985
frequency: 32.9858 58.3564 67.5179 92.3621 153.9046 178.0079 226.8370 313.3473 360.4714 450.6406 463.4747 508.4434 558.8106 582.8744 706.8325 797.0920 823.5036 965.1195 967.5831 1011.4847 1016.3351 1115.1324 1162.7336 1175.8878 1274.2878 1364.0346 1377.9873 1398.4923 1445.8072 1446.7129 1454.0727 1455.6010 1630.2031 1651.2439 2983.1701 2995.6849 3025.3012 3069.7356 3089.5383 3104.9457 3120.1889 3126.1390
redmass: 4.4264 3.5160 1.5691 2.1287 1.2271 2.5641 5.3613 2.7123 3.7373 2.8098 5.6412 3.5283 4.5387 4.1382 4.3575 2.5342 2.1757 2.2331 1.8998 1.5476 1.6404 2.4292 1.4485 1.6550 1.5065 1.2340 1.1929 1.0898 1.0652 1.0560 1.0560 1.0638 9.7187 8.5340 1.0366 1.0363 1.0582 1.0966 1.0960 1.1040 1.1020 1.1003
irintensity: 6.5201 0.5553 3.3781 4.5336 2.2800 1.9501 6.4573 2.0328 3.4800 1.5346 1.3310 0.6126 12.9272 61.2470 6.9481 0.2737 0.8334 32.0215 14.0738 7.1858 8.1627 156.0824 48.2272 20.8706 46.1536 68.0958 39.5374 28.7562 26.9250 17.0252 22.9891 20.5989 175.2264 92.3964 2.4121 1.2772 7.4069 8.7301 6.8468 2.9455 7.2691 13.7701
temp: 298.150 k
press: 1.00000 atm
elementType: 16 8 8 6 6 6 6 6 1 1 1 1 1 1 1 1
symmnumber: 1
zpe: 315831.4 jmol-1
zpe.correction: 0.120294 hartree
zpe.thermalcorrener: 0.130499 hartree
zpe.thermalcorrenthalpy: 0.131443 hartree
zpe.thermalcorrgfe: 0.083202 hartree
zpe.sumelectzpe: -743.207797 hartree
zpe.sumelectthermal: -743.197592 hartree
zpe.sumelectthermalent: -743.196648 hartree
zpe.sumelectthermalfe: -743.244889 hartree
dipole: -0.5814 -0.2991 -2.4116
dipole: 2.4987
quadrupole: -43.9686 -57.5802 -58.9710
quadrupole: -1.5447 -7.2010 2.6809
quadrupole: 9.5380 -4.0736 -5.4644 -1.5447 -7.2010 2.6809
hfenergy: -743.328091 hartree
pointgroup: C01 [X(C5H8O2S1)]
dipole: -0.3376986 -0.814923 0.4339094 debye
dipolederiv: -0.3084734 -0.0305827 -0.2214822 -0.0984608 -0.0683867 -0.1038648 -0.3996487 -0.0689805 -0.6152327 -0.4691253 -0.0119822 0.1038128 -0.1304206 -0.8138081 0.0807816 0.1645263 0.0883318 -0.3846408 -0.5244921 0.2224278 0.2160257 0.021188 -0.5188867 -0.4509606 -0.1647498 -0.2746535 -0.9057778 0.0620531 -0.0717912 0.1750442 -0.1432324 0.015117 0.0644556 0.3080018 0.0852704 -0.1895328 0.6654919 -0.0870988 -0.4191624 0.2065927 0.915062 -0.0685799 -0.626952 -0.0086361 0.5430099 -0.163015 0.1325863 0.1155285 0.1540933 -0.2929508 -0.1842873 0.2482597 -0.2142243 -0.1132627 0.8011287 -0.2794792 0.2274354 -0.0641379 0.4277423 0.5191324 0.7142521 0.3416624 1.4077886 -0.3182189 0.1555431 -0.1120746 0.1945256 -0.0704788 0.0487931 -0.2723076 0.0885688 -0.077725 0.0259951 -0.0008596 -0.0602471 -0.0103848 0.114144 -0.0142172 -0.0512843 0.0046327 0.0146351 -0.02417 0.0184039 0.0054348 0.0237061 -0.0722506 0.0174139 0.0262265 -0.0696842 0.0945679 -0.0177222 -0.0205053 0.0906697 -0.056241 0.0586032 0.0587987 0.1231847 0.031546 0.0510708 0.082528 0.0786811 -0.0149542 0.03747 0.0475411 0.0856526 -0.0790068 0.1049362 -0.0109204 0.0340146 -0.0585908 -0.0768142 -0.0607082 0.0889146 -0.0245807 -0.0419267 -0.0522245 0.0855136 0.0643315 -0.0324387 0.0161447 -0.0063258 0.0239762 0.0836332 0.0161384 0.0790635 0.0637868 0.0842518 0.0140967 0.0137363 0.0126883 0.1160627 -0.0408714 0.0932353 -0.061296 -0.0505528 0.0054221 -0.0284103 -0.0590973 -0.0803527 0.0295986 -0.0712993 -0.0579489 -0.0743127 0.0872723 unknown
polarizability: 88.4671364|-10.336665|65.4627594|4.6492292|5.0396174|73.8685408 unknown
InChI: InChI=1S/C5H8O2S/c1-4(6)3-8-5(2)7/h3H2,1-2H3
charge 0 multiplicity 1
16 atoms
S  -0.871198 0.439464 1.461189
O  1.705019 1.299046 -0.133421
O  -0.979243 -0.758688 -0.995575
C  0.755383 -0.480377 1.263508
C  1.659314 0.077191 0.145323
C  2.500038 -0.966487 -0.572169
C  -1.591042 -0.021495 -0.190291
C  -2.941917 0.612859 -0.448538
H  1.267905 -0.370742 2.237168
H  0.532368 -1.545008 1.089301
H  3.26642 -0.478895 -1.193788
H  2.979357 -1.665331 0.138389
H  1.828537 -1.562571 -1.219527
H  -2.800011 1.49284 -1.103695
H  -3.431852 0.946687 0.480117
H  -3.590776 -0.102092 -0.981887
