program: Gaussian 09
title: 000262711
version: EM64L-G09RevD.01
frameworkgroup: C1[X(C13H15NO2)]
method: RPBEPBE
basis: SDD
operation: Freq
keyword: #p
keyword: freq=noraman
keyword: PBEPBE/SDD
title: #p freq=noraman PBEPBE/SDD
converged: YES YES NO NO
title: Mulliken charges:
elementType: O O N C C C C C C C C C C C C C H H H H H H H H H H H H H H H
charge: -0.273378 -0.245419 -0.378854 -0.180869 -0.469989 -0.560995 0.276162 0.279414 -0.423302 -0.415921 -0.229540 0.221608 -0.229584 -0.625094 0.272351 -0.768724 0.274640 0.233248 0.221414 0.230648 0.226669 0.349825 0.246809 0.239673 0.224761 0.224814 0.266180 0.260072 0.260435 0.244173 0.248775
chargesum: 0.00000
title: Mulliken charges with hydrogens summed into heavy atoms:
elementType: O O N C C C C C C C C C C C C C
charge: -0.273378 -0.245419 -0.029029 0.093771 -0.015327 -0.103679 0.276162 0.279414 -0.176493 -0.176248 -0.004779 0.221608 -0.004770 -0.098842 0.272351 -0.015341
polarizability: 1.93115808e+02 -7.11202755e+00 1.39827586e+02 -1.67360939e+01 -6.33459147e+00 1.16406830e+02
1716.lowfreq: -12.6076 -0.0010 -0.0003 0.0006 2.8394 7.6335 19.0416 31.9234 54.2959
frequency: 18.4395 31.8485 54.2707 67.1389 78.7729 126.6031 151.6441 161.7529 212.0896 219.5703 274.6461 291.5281 352.0639 402.2456 435.5530 455.1861 459.3891 507.3072 523.1984 549.4938 564.8138 597.6780 620.2885 686.2303 723.4052 751.8611 772.4823 790.0653 818.9575 832.8834 858.4025 878.9899 888.8845 927.0249 944.3291 953.9656 972.2869 987.7402 997.8981 1021.2361 1022.2138 1046.5101 1076.5603 1115.1733 1146.8051 1159.3981 1162.2894 1168.5156 1186.3474 1190.4694 1230.0565 1234.4630 1261.1076 1279.9540 1285.7289 1305.4155 1308.3320 1335.7034 1373.9459 1389.7575 1421.4441 1441.8874 1446.1355 1452.2572 1459.5205 1473.9037 1477.9335 1518.8465 1597.4493 1606.5142 1618.3631 1632.2236 2979.5820 2979.6991 2982.4940 2997.3921 3005.9423 3047.5228 3063.5976 3083.8682 3089.2690 3119.6002 3126.8276 3128.0341 3140.9321 3159.2739 3383.9512
redmass: 5.2134 3.6906 4.5781 5.1047 3.0208 3.5257 1.2034 2.3456 4.7802 3.6786 4.1556 4.6028 3.1285 3.1618 3.5442 3.3686 2.4422 3.7599 4.2148 4.0810 3.3265 4.8845 3.5400 4.3183 3.0132 1.7567 1.7695 1.2024 2.3152 3.6735 1.7570 1.7674 1.8441 2.6472 1.4710 2.3788 1.9474 1.3190 2.6862 1.8808 2.0502 2.2905 2.7214 2.7123 1.4232 1.4532 1.6088 1.0851 1.8022 1.5848 1.8881 2.5283 1.3343 1.5795 1.3694 1.4695 1.7856 1.4159 1.2508 6.9349 1.0945 1.0730 2.4130 1.0533 1.2601 1.4148 1.4699 1.8062 6.9997 7.2203 7.1372 6.2905 1.0645 1.0557 1.0490 1.0778 1.0696 1.0961 1.0956 1.1021 1.0925 1.0852 1.1003 1.0892 1.0946 1.1004 1.0803
irintensity: 0.1936 1.1638 1.3698 3.2844 14.5539 4.2632 0.2127 1.1049 10.3176 4.5698 7.6848 2.1724 1.7728 1.6785 4.1156 9.7744 5.2349 18.2159 16.5985 3.0865 7.2886 0.9366 5.8647 2.9953 14.2845 26.4639 52.5470 87.9143 8.4604 2.8010 2.3514 0.8571 2.7277 8.7500 2.0323 10.6537 11.6957 0.0714 3.7591 19.3816 2.1983 3.4222 6.7286 1.1387 6.6231 39.3529 4.9851 1.2505 10.5448 2.5492 7.7272 115.9298 5.1185 3.4892 31.2193 6.5068 58.9658 4.7697 74.6724 2.6694 56.6329 20.4304 7.1310 18.2507 10.3496 3.0445 19.2648 403.0015 2.2594 18.7610 5.9661 313.4035 36.0974 0.5531 2.0238 2.0769 37.4618 29.3090 8.0246 31.6438 8.3197 2.8108 11.5492 4.9598 34.6204 32.7578 148.7445
temp: 298.150 k
press: 1.00000 atm
elementType: 8 8 7 6 6 6 6 6 6 6 6 6 6 6 6 6 1 1 1 1 1 1 1 1 1 1 1 1 1 1 1
symmnumber: 1
zpe: 661985.8 jmol-1
zpe.correction: 0.252137 hartree
zpe.thermalcorrener: 0.267112 hartree
zpe.thermalcorrenthalpy: 0.268057 hartree
zpe.thermalcorrgfe: 0.207744 hartree
zpe.sumelectzpe: -708.434864 hartree
zpe.sumelectthermal: -708.419889 hartree
zpe.sumelectthermalent: -708.418944 hartree
zpe.sumelectthermalfe: -708.479257 hartree
dipole: -1.6386 -0.8982 -1.6584
dipole: 2.4984
quadrupole: -71.3530 -90.0949 -106.5987
quadrupole: 5.1683 0.3668 -9.1700
quadrupole: 17.9959 -0.7460 -17.2498 5.1683 0.3668 -9.1700
hfenergy: -708.6870009 hartree
pointgroup: C01 [X(C13H15N1O2)]
dipole: -0.6313084 0.0904544 0.7479748 debye
polarizability: 191.5062748|-10.2197299|141.5794977|18.1938725|3.8651624|116.2644509 unknown
InChI: InChI=1S/C13H15NO2/c1-9(15)8-13(16)14-12-7-6-10-4-2-3-5-11(10)12/h2-5,12,14H,6-8H2,1H3
charge 0 multiplicity 1
31 atoms
O  -1.817078 0.546062 -2.265899
O  -2.620789 0.484322 1.943865
N  -0.832021 0.215199 -0.1693
C  0.363908 -0.475791 -0.670137
C  0.407374 -2.001488 -0.319187
C  1.923145 -2.354012 -0.228461
C  1.67346 0.045388 -0.079876
C  2.56373 -1.028869 0.170321
C  2.050411 1.376006 0.18472
C  3.847545 -0.779036 0.694892
C  3.338786 1.628013 0.717205
C  -1.836388 0.651049 -1.000585
C  4.230606 0.557282 0.97068
C  -3.026991 1.359318 -0.305682
C  -3.46146 0.849481 1.070047
C  -4.953386 0.812606 1.343934
H  0.350457 -0.337441 -1.769041
H  -0.141453 -2.610825 -1.056678
H  -0.068961 -2.148722 0.668989
H  2.305804 -2.682371 -1.215908
H  2.131358 -3.170092 0.486465
H  -0.997402 0.281785 0.846952
H  1.355875 2.200793 -0.012216
H  4.54148 -1.604228 0.894212
H  3.64836 2.656075 0.937078
H  5.223075 0.765114 1.386855
H  -2.739083 2.425049 -0.180812
H  -3.868795 1.344223 -1.016574
H  -5.145946 0.57225 2.400535
H  -5.42387 1.779287 1.084069
H  -5.430051 0.045773 0.702632
