program: Gaussian 09
title: 000262694
version: EM64L-G09RevD.01
frameworkgroup: C1[X(C10H14N2O5S)]
method: RPBEPBE
basis: SDD
operation: Freq
keyword: #p
keyword: freq=noraman
keyword: PBEPBE/SDD
title: #p freq=noraman PBEPBE/SDD
converged: YES YES NO NO
title: Mulliken charges:
elementType: S O O O O O N N C C C C C C C C C C H H H H H H H H H H H H H H
charge: 0.173212 -0.413868 -0.445722 -0.427333 -0.259352 -0.241386 -0.123033 -0.402488 -0.024095 -0.149384 -0.542249 -0.490543 -0.305852 -0.169877 0.238825 0.208239 0.082509 -0.790895 0.262077 0.287105 0.338644 0.304398 0.235452 0.208949 0.363314 0.358167 0.271288 0.364640 0.348059 0.231678 0.232740 0.276783
chargesum: 0.00000
title: Mulliken charges with hydrogens summed into heavy atoms:
elementType: S O O O O O N N C C C C C C C C C C
charge: 0.173212 -0.050554 -0.087555 -0.079274 -0.259352 -0.241386 -0.123033 -0.037848 0.237982 0.137721 -0.203606 -0.186145 0.138549 0.101410 0.238825 0.208239 0.082509 -0.049693
polarizability: 2.18653474e+02 5.06946824e+00 1.46983907e+02 3.36986443e-01 1.15058713e+01 1.17255211e+02
1716.lowfreq: -101.8179 -7.5551 -2.5424 0.0015 0.0016 0.0017 8.1555 20.7368 37.4626
frequency: -101.8175 20.5054 37.4531 50.8998 72.3976 100.8085 105.6464 128.4712 149.4140 170.5640 205.8575 225.2843 250.5116 265.1674 290.3328 306.2012 331.5941 355.5061 381.6232 390.8821 420.5291 437.0354 443.9710 454.2542 458.5923 522.3519 542.8705 567.0456 611.5671 643.9082 685.9377 694.9398 718.3919 726.1372 735.5105 773.3340 787.4853 833.8700 874.5013 886.1845 919.8128 940.5296 991.6901 1007.2097 1014.1883 1035.3147 1051.8905 1077.9825 1088.2287 1119.9912 1132.8365 1139.5398 1172.9851 1188.1440 1225.0636 1226.9606 1238.0269 1246.6364 1261.6726 1297.5422 1317.4053 1334.6055 1336.0950 1355.6066 1363.4095 1374.9269 1376.6267 1382.5167 1400.4009 1421.4632 1453.2609 1472.2872 1486.2241 1618.6348 1638.1847 1666.8399 2986.1803 2989.1807 3042.3416 3047.0515 3065.1751 3070.5870 3073.7461 3075.1028 3104.6557 3156.3623 3479.2731 3485.4127 3524.3113 3551.1961
redmass: 1.0193 7.0066 5.9646 8.3211 4.5268 6.3025 4.7789 5.0444 4.7613 8.5917 7.5735 4.9381 5.8308 3.2289 3.4142 6.1329 1.2575 5.2185 10.9082 4.1515 5.3417 1.8229 2.3262 3.1050 4.9075 7.2210 1.2192 3.3409 5.1713 5.1165 3.8541 3.5493 2.6665 5.2138 6.4244 5.0554 2.3397 3.8423 3.0498 1.4580 2.8043 1.8925 3.1580 3.9985 1.5866 3.3889 1.4440 2.7731 3.0359 3.2693 1.1541 4.0052 1.3123 1.2303 4.8916 1.4410 1.4951 1.5340 1.6041 1.5500 1.4674 1.2703 2.0991 1.2003 1.5167 1.7827 1.3336 1.2458 1.2365 2.0546 1.0817 1.1595 1.0460 6.0879 9.2025 6.5648 1.0634 1.0373 1.0848 1.0849 1.0905 1.0989 1.0967 1.0865 1.0980 1.0930 1.0650 1.0654 1.0769 1.0664
irintensity: 0.1159 0.1606 2.8040 0.0244 3.2203 0.8544 1.4544 4.1416 0.7076 7.6241 6.8226 3.9793 13.1315 32.3141 3.9967 3.7343 189.4548 4.4845 18.8395 14.1514 3.9853 14.5868 40.0877 24.5802 19.2059 45.7572 146.8468 45.4201 9.1958 7.9782 3.3474 38.9327 15.3050 14.4785 5.3516 25.8189 124.3418 73.4148 7.2070 15.8321 23.0797 79.4764 25.3008 36.6115 6.8988 42.0314 5.2994 87.4791 26.3126 68.2672 13.2702 24.4555 71.1651 9.0564 16.8097 144.0362 10.1157 59.8904 16.4411 21.0025 36.4016 56.4153 75.9575 30.7655 55.9915 18.2490 26.8313 65.2734 25.3795 56.0507 7.6878 10.1362 16.9141 192.4469 266.5735 583.6149 36.2114 26.2573 0.1471 15.9464 4.7248 17.0389 41.9228 8.6509 1.2901 3.3389 28.1448 9.2220 66.5957 10.1065
temp: 298.150 k
press: 1.00000 atm
elementType: 16 8 8 8 8 8 7 7 6 6 6 6 6 6 6 6 6 6 1 1 1 1 1 1 1 1 1 1 1 1 1 1
symmnumber: 1
zpe: 638105.1 jmol-1
zpe.correction: 0.243041 hartree
zpe.thermalcorrener: 0.260634 hartree
zpe.thermalcorrenthalpy: 0.261579 hartree
zpe.thermalcorrgfe: 0.196335 hartree
zpe.sumelectzpe: -1271.782903 hartree
zpe.sumelectthermal: -1271.765310 hartree
zpe.sumelectthermalent: -1271.764366 hartree
zpe.sumelectthermalfe: -1271.829609 hartree
dipole: -3.4872 1.7673 0.7740
dipole: 3.9854
quadrupole: -136.2150 -121.8015 -112.6323
quadrupole: 5.0503 1.1923 3.9743
quadrupole: -12.6654 1.7481 10.9173 5.0503 1.1923 3.9743
hfenergy: -1272.0259443 hartree
pointgroup: C01 [X(C10H14N2O5S1)]
dipole: 1.3726689 0.7204993 -0.2348772 debye
polarizability: 218.6664575|-4.8630707|148.6347427|0.8425909|-8.9832169|115.5913927 unknown
InChI: InChI=1S/C10H14N2O5S/c1-4-2-12(10(17)11-8(4)16)9-7(15)6(14)5(3-13)18-9/h2,5-7,9,11,13-15H,3H2,1H3
charge 0 multiplicity 1
32 atoms
S  1.70207 0.574185 1.135822
O  1.010317 -2.042635 -1.932162
O  3.40232 -1.703139 -0.489686
O  4.486046 2.303597 0.942071
O  -1.322386 -2.343153 1.233587
O  -4.807448 0.528195 0.042284
N  -0.780405 -0.33337 0.114311
N  -3.026592 -0.866636 0.60301
C  1.283268 -0.769024 -1.293664
C  2.800007 -0.514038 -1.126915
C  0.63614 -0.687354 0.124895
C  2.975526 0.770636 -0.304264
C  4.386462 1.015323 0.253192
C  -1.220151 0.882906 -0.420137
C  -1.689753 -1.264871 0.694488
C  -2.540349 1.258195 -0.487458
C  -3.558385 0.332185 0.041154
C  -2.999457 2.578873 -1.066092
H  0.840251 -0.008063 -1.96036
H  3.295356 -0.444846 -2.109902
H  0.699661 -1.660049 0.638652
H  2.669047 1.649761 -0.897846
H  5.097383 1.088633 -0.58835
H  4.703983 0.176834 0.904871
H  1.644939 -2.705914 -1.543694
H  3.248088 -1.645517 0.492597
H  -0.423325 1.550312 -0.761191
H  -3.709183 -1.523608 0.994942
H  3.989109 2.259828 1.798974
H  -2.732223 2.673293 -2.134167
H  -2.558651 3.43729 -0.527782
H  -4.096263 2.646872 -0.982078
